{"text_format":"1","workbook":"xlsx","n_sheets":10,"sheets":["FT","HFT1","HFT2","nHFT","JUNIOR","DRUŻYNY","Sylwetki Karabin","Sylwetki Pistolet","Weterani i Kobiety","DaneZawodnikow"],"not_rendered":{"charts":0,"images":0,"macros":1,"external_links":0,"defined_names":1,"comments":0,"pivot_tables":0},"unopened":[],"bounds":{"document_bytes":16777216,"sheet_cells":100000,"rows_first":2000,"rows_last":500,"rows_between":2000,"halvings":0,"cell_chars":16384,"cell_head_chars":4096},"cells_cut":0,"cells_raw":0,"read":"whole","date_system":"1900"}

{"sheet":"FT","index":0,"n_rows":24,"n_cols":47,"rows_kept":24,"cut":false,"hidden":false,"merged":[[5,2,5,4],[6,2,6,4],[5,0,5,1],[6,0,6,1],[3,0,3,1],[4,2,4,4],[4,0,4,1],[3,6,3,46],[1,0,1,1],[0,3,0,5],[1,3,1,5],[2,3,2,5],[3,2,3,4]]}
["Celów:",40]
[null,null,null,"% trafień",null,null,{"$f":"(COUNTIF(G9:G74,1)/COUNTA(G9:G74))*100","v":100},{"$f":"(COUNTIF(H9:H74,1)/COUNTA(H9:H74))*100","v":93.75},81.25,81.25,81.25,68.75,68.75,68.75,100,75,50,62.5,68.75,50,68.75,37.5,75,31.25,18.75,6.25,81.25,87.5,81.25,87.5,87.5,56.25,37.5,25,62.5,56.25,87.5,81.25,50,56.25,81.25,62.5,75,68.75,81.25,87.5]
[null,null,null,"% pudło",null,null,{"$f":"(COUNTIF(G9:G74,0)/COUNTA(G9:G74))*100","v":0},{"$f":"(COUNTIF(H9:H74,0)/COUNTA(H9:H74))*100","v":6.25},18.75,18.75,18.75,31.25,31.25,31.25,0,25,50,37.5,31.25,50,31.25,62.5,25,68.75,81.25,93.75,18.75,12.5,18.75,12.5,12.5,43.75,62.5,75,37.5,43.75,12.5,18.75,50,43.75,18.75,37.5,25,31.25,18.75,12.5]
[]
[null,null,null,null,null,"Cel nr",1,2,3,4,5,6,7,8,9,10,11,12,13,14,15,16,17,18,19,20,21,22,23,24,25,26,27,28,29,30,31,32,33,34,35,36,37,38,39,40,"D"]
["Data:",null,43611,null,null,"dystans [m]",23,20,37,44,30,39,42,49,9,32,46,42,38,50,24,30,42,50,31,38,19,21,25,39,40,33,30,40,22,37,33,40,41,50,34,22.5,19,27,31,16]
["Kategoria:",null,"FT",null,null,"KZ [mm]",15,20,25,40,25,40,35,40,20,30,40,40,35,40,35,40,35,40,35,40,15,20,20,40,40,25,40,40,15,30,30,40,35,40,25,15,15,20,35,35]
["Miejsce","Imię, nazwisko","Nick","Suma punktów","% do zwycięzcy","postawa/ uwagi",null,null,null,null,null,null,null,null,null,null,null,null,null,null,"kl","kl",null,null,"st","st",null,null,null,null,null,null,"st","st",null,null,null,null,null,null,"m",null,null,null,"kl","kl"]
[1,"Majda Jarosław",{"$f":"IF(NOT(B9=\"\"),IF(VLOOKUP(B9,Tabela1[[Nick]:[Imię + Nazwisko]],2,FALSE)<>0,VLOOKUP(B9,Tabela1[[Nick]:[Imię + Nazwisko]],2,FALSE),\"\"),\"\")","v":"czaputek"},{"$f":"SUM(G9:AT9)","v":36},{"$f":"IF(A9=1,100,IF($D$9<>0,D9/$D$9*100,\"\"))","v":100},{"$f":"IF(B9<>\"\",IF(VLOOKUP(B9,Tabela1[[#All],[Imię + Nazwisko]:[K]],11,FALSE)=1,\"K\",\"\")&IF(VLOOKUP(B9,Tabela1[[#All],[Imię + Nazwisko]:[K]],10,FALSE)=1,\"W\",\"\"),\"\")","v":""},1,1,1,1,1,1,1,1,1,1,0,1,1,1,1,1,1,1,0,0,1,1,1,1,1,1,1,1,0,1,1,1,1,1,1,1,1,1,1,1]
[2,"Rozum Radosław",{"$f":"IF(NOT(B10=\"\"),IF(VLOOKUP(B10,Tabela1[[Nick]:[Imię + Nazwisko]],2,FALSE)<>0,VLOOKUP(B10,Tabela1[[Nick]:[Imię + Nazwisko]],2,FALSE),\"\"),\"\")","v":"Roar"},34,94.444444444444443,{"$f":"IF(B10<>\"\",IF(VLOOKUP(B10,Tabela1[[#All],[Imię + Nazwisko]:[K]],11,FALSE)=1,\"K\",\"\")&IF(VLOOKUP(B10,Tabela1[[#All],[Imię + Nazwisko]:[K]],10,FALSE)=1,\"W\",\"\"),\"\")","v":""},1,1,1,1,1,1,1,1,1,1,1,1,1,1,1,0,1,0,0,0,1,1,1,1,1,1,1,0,1,1,1,1,1,1,1,0,1,1,1,1]
[3,"Pachnik Rafał",{"$f":"IF(NOT(B11=\"\"),IF(VLOOKUP(B11,Tabela1[[Nick]:[Imię + Nazwisko]],2,FALSE)<>0,VLOOKUP(B11,Tabela1[[Nick]:[Imię + Nazwisko]],2,FALSE),\"\"),\"\")","v":"ralph"},33,91.666666666666657,{"$f":"IF(B11<>\"\",IF(VLOOKUP(B11,Tabela1[[#All],[Imię + Nazwisko]:[K]],11,FALSE)=1,\"K\",\"\")&IF(VLOOKUP(B11,Tabela1[[#All],[Imię + Nazwisko]:[K]],10,FALSE)=1,\"W\",\"\"),\"\")","v":""},1,1,1,1,1,1,1,1,1,1,1,1,1,1,0,1,1,0,0,0,1,1,1,1,1,0,0,0,1,1,1,1,1,1,1,1,1,1,1,1]
[4,"Markisz Marcin",{"$f":"IF(NOT(B12=\"\"),IF(VLOOKUP(B12,Tabela1[[Nick]:[Imię + Nazwisko]],2,FALSE)<>0,VLOOKUP(B12,Tabela1[[Nick]:[Imię + Nazwisko]],2,FALSE),\"\"),\"\")","v":"MarcinMM"},31,86.111111111111114,{"$f":"IF(B12<>\"\",IF(VLOOKUP(B12,Tabela1[[#All],[Imię + Nazwisko]:[K]],11,FALSE)=1,\"K\",\"\")&IF(VLOOKUP(B12,Tabela1[[#All],[Imię + Nazwisko]:[K]],10,FALSE)=1,\"W\",\"\"),\"\")","v":""},1,1,1,1,1,1,1,0,1,1,0,1,1,1,1,0,1,1,0,0,1,1,1,1,1,1,1,1,1,0,1,1,1,0,1,1,0,0,1,1]
[5,"Dylewski Andrzej",{"$f":"IF(NOT(B13=\"\"),IF(VLOOKUP(B13,Tabela1[[Nick]:[Imię + Nazwisko]],2,FALSE)<>0,VLOOKUP(B13,Tabela1[[Nick]:[Imię + Nazwisko]],2,FALSE),\"\"),\"\")","v":"Andrzej"},30,83.333333333333343,{"$f":"IF(B13<>\"\",IF(VLOOKUP(B13,Tabela1[[#All],[Imię + Nazwisko]:[K]],11,FALSE)=1,\"K\",\"\")&IF(VLOOKUP(B13,Tabela1[[#All],[Imię + Nazwisko]:[K]],10,FALSE)=1,\"W\",\"\"),\"\")","v":""},1,1,1,1,1,1,0,1,1,1,1,0,1,1,1,1,0,0,1,0,1,0,1,1,1,1,0,1,1,1,1,1,0,0,1,0,1,1,1,1]
[5,"Rup Dariusz",{"$f":"IF(NOT(B14=\"\"),IF(VLOOKUP(B14,Tabela1[[Nick]:[Imię + Nazwisko]],2,FALSE)<>0,VLOOKUP(B14,Tabela1[[Nick]:[Imię + Nazwisko]],2,FALSE),\"\"),\"\")","v":"Zapp"},30,83.333333333333343,{"$f":"IF(B14<>\"\",IF(VLOOKUP(B14,Tabela1[[#All],[Imię + Nazwisko]:[K]],11,FALSE)=1,\"K\",\"\")&IF(VLOOKUP(B14,Tabela1[[#All],[Imię + Nazwisko]:[K]],10,FALSE)=1,\"W\",\"\"),\"\")","v":""},1,1,1,0,1,1,1,0,1,1,1,0,1,1,0,1,1,1,1,0,1,1,1,1,1,1,0,0,1,1,1,1,0,1,1,1,1,0,0,1]
[5,"Tałaj Szymon",{"$f":"IF(NOT(B15=\"\"),IF(VLOOKUP(B15,Tabela1[[Nick]:[Imię + Nazwisko]],2,FALSE)<>0,VLOOKUP(B15,Tabela1[[Nick]:[Imię + Nazwisko]],2,FALSE),\"\"),\"\")","v":"slowroots"},30,83.333333333333343,{"$f":"IF(B15<>\"\",IF(VLOOKUP(B15,Tabela1[[#All],[Imię + Nazwisko]:[K]],11,FALSE)=1,\"K\",\"\")&IF(VLOOKUP(B15,Tabela1[[#All],[Imię + Nazwisko]:[K]],10,FALSE)=1,\"W\",\"\"),\"\")","v":""},1,1,1,1,1,1,1,1,1,0,1,1,0,0,1,0,1,0,0,0,1,1,1,1,1,1,1,0,1,0,1,1,1,0,1,1,1,1,1,1]
[8,"Adamczak Krzysztof",{"$f":"IF(NOT(B16=\"\"),IF(VLOOKUP(B16,Tabela1[[Nick]:[Imię + Nazwisko]],2,FALSE)<>0,VLOOKUP(B16,Tabela1[[Nick]:[Imię + Nazwisko]],2,FALSE),\"\"),\"\")","v":"krzysieka"},29,80.555555555555557,{"$f":"IF(B16<>\"\",IF(VLOOKUP(B16,Tabela1[[#All],[Imię + Nazwisko]:[K]],11,FALSE)=1,\"K\",\"\")&IF(VLOOKUP(B16,Tabela1[[#All],[Imię + Nazwisko]:[K]],10,FALSE)=1,\"W\",\"\"),\"\")","v":""},1,1,1,1,1,0,1,1,1,1,0,1,1,0,1,0,1,1,1,0,1,1,1,0,1,0,1,1,1,1,1,0,0,1,1,0,0,1,1,1]
[9,"Drabik Marcin",{"$f":"IF(NOT(B17=\"\"),IF(VLOOKUP(B17,Tabela1[[Nick]:[Imię + Nazwisko]],2,FALSE)<>0,VLOOKUP(B17,Tabela1[[Nick]:[Imię + Nazwisko]],2,FALSE),\"\"),\"\")","v":"DrA"},28,77.777777777777786,{"$f":"IF(B17<>\"\",IF(VLOOKUP(B17,Tabela1[[#All],[Imię + Nazwisko]:[K]],11,FALSE)=1,\"K\",\"\")&IF(VLOOKUP(B17,Tabela1[[#All],[Imię + Nazwisko]:[K]],10,FALSE)=1,\"W\",\"\"),\"\")","v":""},1,1,1,1,1,1,0,1,1,1,1,1,0,0,0,1,1,0,0,0,0,1,1,1,1,1,0,0,1,0,1,1,1,1,1,0,1,1,1,1]
[10,"Winiarek Mirosław",{"$f":"IF(NOT(B18=\"\"),IF(VLOOKUP(B18,Tabela1[[Nick]:[Imię + Nazwisko]],2,FALSE)<>0,VLOOKUP(B18,Tabela1[[Nick]:[Imię + Nazwisko]],2,FALSE),\"\"),\"\")","v":"wirek"},27,75,{"$f":"IF(B18<>\"\",IF(VLOOKUP(B18,Tabela1[[#All],[Imię + Nazwisko]:[K]],11,FALSE)=1,\"K\",\"\")&IF(VLOOKUP(B18,Tabela1[[#All],[Imię + Nazwisko]:[K]],10,FALSE)=1,\"W\",\"\"),\"\")","v":"W"},1,1,1,1,1,0,0,0,1,1,1,0,1,1,1,0,1,1,0,1,1,1,1,1,1,0,0,0,0,1,0,1,1,1,0,1,1,1,1,0]
[10,"Poliński Adam",{"$f":"IF(NOT(B19=\"\"),IF(VLOOKUP(B19,Tabela1[[Nick]:[Imię + Nazwisko]],2,FALSE)<>0,VLOOKUP(B19,Tabela1[[Nick]:[Imię + Nazwisko]],2,FALSE),\"\"),\"\")","v":"kadzislaw"},27,75,{"$f":"IF(B19<>\"\",IF(VLOOKUP(B19,Tabela1[[#All],[Imię + Nazwisko]:[K]],11,FALSE)=1,\"K\",\"\")&IF(VLOOKUP(B19,Tabela1[[#All],[Imię + Nazwisko]:[K]],10,FALSE)=1,\"W\",\"\"),\"\")","v":""},1,1,1,1,1,1,0,1,1,1,0,1,1,1,1,0,0,0,0,0,1,1,1,1,1,0,0,0,1,0,1,1,0,1,1,1,1,1,0,1]
[12,"Merski Tomasz",{"$f":"IF(NOT(B20=\"\"),IF(VLOOKUP(B20,Tabela1[[Nick]:[Imię + Nazwisko]],2,FALSE)<>0,VLOOKUP(B20,Tabela1[[Nick]:[Imię + Nazwisko]],2,FALSE),\"\"),\"\")","v":"Jester"},25,69.444444444444443,{"$f":"IF(B20<>\"\",IF(VLOOKUP(B20,Tabela1[[#All],[Imię + Nazwisko]:[K]],11,FALSE)=1,\"K\",\"\")&IF(VLOOKUP(B20,Tabela1[[#All],[Imię + Nazwisko]:[K]],10,FALSE)=1,\"W\",\"\"),\"\")","v":""},1,1,0,1,0,0,1,1,1,0,0,0,0,0,1,1,1,0,0,0,1,1,1,1,1,1,0,0,1,1,1,0,0,1,1,1,1,1,1,1]
[13,"Frasińska Katarzyna",{"$f":"IF(NOT(B21=\"\"),IF(VLOOKUP(B21,Tabela1[[Nick]:[Imię + Nazwisko]],2,FALSE)<>0,VLOOKUP(B21,Tabela1[[Nick]:[Imię + Nazwisko]],2,FALSE),\"\"),\"\")","v":"Kasia F"},21,58.333333333333336,{"$f":"IF(B21<>\"\",IF(VLOOKUP(B21,Tabela1[[#All],[Imię + Nazwisko]:[K]],11,FALSE)=1,\"K\",\"\")&IF(VLOOKUP(B21,Tabela1[[#All],[Imię + Nazwisko]:[K]],10,FALSE)=1,\"W\",\"\"),\"\")","v":"K"},1,1,1,1,1,1,1,1,1,0,0,1,1,0,1,0,1,0,0,0,0,1,0,1,0,0,0,0,0,0,1,1,1,0,1,0,0,0,1,1]
[14,"Domagała Leszek",{"$f":"IF(NOT(B22=\"\"),IF(VLOOKUP(B22,Tabela1[[Nick]:[Imię + Nazwisko]],2,FALSE)<>0,VLOOKUP(B22,Tabela1[[Nick]:[Imię + Nazwisko]],2,FALSE),\"\"),\"\")","v":"Willi"},20,55.555555555555557,{"$f":"IF(B22<>\"\",IF(VLOOKUP(B22,Tabela1[[#All],[Imię + Nazwisko]:[K]],11,FALSE)=1,\"K\",\"\")&IF(VLOOKUP(B22,Tabela1[[#All],[Imię + Nazwisko]:[K]],10,FALSE)=1,\"W\",\"\"),\"\")","v":"W"},1,1,1,0,0,1,1,0,1,1,0,1,1,0,1,0,0,0,0,0,0,1,0,1,1,0,1,0,0,0,1,0,0,0,0,1,1,1,1,1]
[15,"Czorny Magdalena",{"$f":"IF(NOT(B23=\"\"),IF(VLOOKUP(B23,Tabela1[[Nick]:[Imię + Nazwisko]],2,FALSE)<>0,VLOOKUP(B23,Tabela1[[Nick]:[Imię + Nazwisko]],2,FALSE),\"\"),\"\")","v":"Czorna"},19,52.777777777777779,{"$f":"IF(B23<>\"\",IF(VLOOKUP(B23,Tabela1[[#All],[Imię + Nazwisko]:[K]],11,FALSE)=1,\"K\",\"\")&IF(VLOOKUP(B23,Tabela1[[#All],[Imię + Nazwisko]:[K]],10,FALSE)=1,\"W\",\"\"),\"\")","v":"K"},1,1,0,1,1,0,0,1,1,1,0,0,0,0,0,0,1,0,0,0,1,0,1,1,1,1,0,0,0,1,0,1,0,0,1,1,1,0,0,1]
[16,"Augustyniak Piotr",{"$f":"IF(NOT(B24=\"\"),IF(VLOOKUP(B24,Tabela1[[Nick]:[Imię + Nazwisko]],2,FALSE)<>0,VLOOKUP(B24,Tabela1[[Nick]:[Imię + Nazwisko]],2,FALSE),\"\"),\"\")","v":"Augustyn"},9,25,{"$f":"IF(B24<>\"\",IF(VLOOKUP(B24,Tabela1[[#All],[Imię + Nazwisko]:[K]],11,FALSE)=1,\"K\",\"\")&IF(VLOOKUP(B24,Tabela1[[#All],[Imię + Nazwisko]:[K]],10,FALSE)=1,\"W\",\"\"),\"\")","v":""},1,0,0,0,0,0,1,0,1,0,1,0,0,0,0,0,0,0,0,0,1,1,0,0,0,0,0,0,0,0,1,1,0,0,0,0,0,0,1,0]

{"sheet":"HFT1","index":1,"n_rows":41,"n_cols":47,"rows_kept":41,"cut":false,"hidden":false,"merged":[[6,0,6,1],[6,2,6,4],[0,3,0,5],[1,0,1,1],[1,3,1,5],[2,3,2,5],[3,0,3,1],[3,2,3,4],[3,6,3,46],[4,0,4,1],[4,2,4,4],[5,0,5,1],[5,2,5,4]]}
["Celów:",40,null,"% trafień za 2 pkt",null,null,{"$f":"(COUNTIF(G9:G74,2)/COUNTA(G9:G74))*100","v":100},{"$f":"(COUNTIF(H9:H74,2)/COUNTA(H9:H74))*100","v":81.818181818181827},84.848484848484844,78.787878787878782,63.636363636363633,87.878787878787875,69.696969696969703,81.818181818181827,84.848484848484844,57.575757575757578,54.54545454545454,63.636363636363633,66.666666666666657,81.818181818181827,60.606060606060609,36.363636363636367,90.909090909090907,72.727272727272734,24.242424242424242,24.242424242424242,81.818181818181827,75.757575757575751,93.939393939393938,72.727272727272734,69.696969696969703,69.696969696969703,36.363636363636367,18.181818181818183,66.666666666666657,78.787878787878782,69.696969696969703,81.818181818181827,57.575757575757578,96.969696969696969,60.606060606060609,75.757575757575751,81.818181818181827,66.666666666666657,51.515151515151516,84.848484848484844]
[null,null,null,"% trafień za 1 pkt",null,null,{"$f":"(COUNTIF(G9:G74,1)/COUNTA(G9:G74))*100","v":0},{"$f":"(COUNTIF(H9:H74,1)/COUNTA(H9:H74))*100","v":18.181818181818183},15.151515151515152,21.212121212121211,36.363636363636367,12.121212121212121,30.303030303030305,18.181818181818183,15.151515151515152,42.424242424242422,42.424242424242422,27.27272727272727,30.303030303030305,18.181818181818183,39.393939393939391,63.636363636363633,9.0909090909090917,27.27272727272727,72.727272727272734,72.727272727272734,18.181818181818183,24.242424242424242,6.0606060606060606,27.27272727272727,30.303030303030305,30.303030303030305,51.515151515151516,69.696969696969703,33.333333333333329,21.212121212121211,27.27272727272727,18.181818181818183,39.393939393939391,3.0303030303030303,27.27272727272727,24.242424242424242,18.181818181818183,33.333333333333329,45.454545454545453,12.121212121212121]
[null,null,null,"% trafień za 0 pkt",null,null,{"$f":"(COUNTIF(G9:G74,0)/COUNTA(G9:G74))*100","v":0},{"$f":"(COUNTIF(H9:H74,0)/COUNTA(H9:H74))*100","v":0},0,0,0,0,0,0,0,0,3.0303030303030303,9.0909090909090917,3.0303030303030303,0,0,0,0,0,3.0303030303030303,3.0303030303030303,0,0,0,0,0,0,12.121212121212121,12.121212121212121,0,0,3.0303030303030303,0,3.0303030303030303,0,12.121212121212121,0,0,0,3.0303030303030303,3.0303030303030303]
[]
[null,null,null,null,null,"Cel nr",1,2,3,4,5,6,7,8,9,10,11,12,13,14,15,16,17,18,19,20,21,22,23,24,25,26,27,28,29,30,31,32,33,34,35,36,37,38,39,40,"D"]
["Data:",null,43611,null,null,"dystans [m]",23,20,22.5,37,18,30,42,38,9,32,37,42,38,32,24,30,33,42,31,30,19,21,25,21,40,33,30,32,22,37,33,24,41,19,34,22.5,19,27,31,16]
["Kategoria:",null,"HFT1",null,null,"KZ [mm]",15,20,20,25,15,25,35,40,20,30,25,40,35,30,35,40,25,35,35,40,15,20,20,15,40,25,40,35,15,30,30,20,35,15,25,15,15,20,35,35]
["Miejsce","Imię, nazwisko","Nick","Suma punktów","% do zwycięzcy","postawa/ uwagi",null,null,"L","L",null,null,null,null,null,null,null,null,null,null,"kl","kl",null,null,"st","st",null,null,"L","L",null,null,"st","st",null,null,null,null,null,null,"m",null,null,null,"kl","kl"]
[1,"Kostowski Jacek",{"$f":"IF(NOT(B9=\"\"),IF(VLOOKUP(B9,Tabela1[[Nick]:[Imię + Nazwisko]],2,FALSE)<>0,VLOOKUP(B9,Tabela1[[Nick]:[Imię + Nazwisko]],2,FALSE),\"\"),\"\")","v":"pilot68"},{"$f":"SUM(G9:AT9)","v":77},{"$f":"IF(A9=1,100,IF($D$9<>0,D9/$D$9*100,\"\"))","v":100},{"$f":"IF(B9<>\"\",IF(VLOOKUP(B9,Tabela1[[#All],[Imię + Nazwisko]:[K]],11,FALSE)=1,\"K\",\"\")&IF(VLOOKUP(B9,Tabela1[[#All],[Imię + Nazwisko]:[K]],10,FALSE)=1,\"W\",\"\"),\"\")","v":""},2,2,2,2,2,2,2,2,2,2,2,2,2,2,2,2,2,2,1,2,2,2,2,2,2,2,2,1,2,1,2,2,2,2,2,2,2,2,2,2]
[2,"Narbut Jarosław",{"$f":"IF(NOT(B10=\"\"),IF(VLOOKUP(B10,Tabela1[[Nick]:[Imię + Nazwisko]],2,FALSE)<>0,VLOOKUP(B10,Tabela1[[Nick]:[Imię + Nazwisko]],2,FALSE),\"\"),\"\")","v":"Jarn"},76,98.701298701298697,{"$f":"IF(B10<>\"\",IF(VLOOKUP(B10,Tabela1[[#All],[Imię + Nazwisko]:[K]],11,FALSE)=1,\"K\",\"\")&IF(VLOOKUP(B10,Tabela1[[#All],[Imię + Nazwisko]:[K]],10,FALSE)=1,\"W\",\"\"),\"\")","v":""},2,2,2,2,2,2,2,2,2,1,2,2,2,2,2,2,2,2,2,1,2,2,2,2,2,1,2,1,2,2,2,2,2,2,2,2,2,2,2,2,1]
[3,"Nachman Norbert",{"$f":"IF(NOT(B11=\"\"),IF(VLOOKUP(B11,Tabela1[[Nick]:[Imię + Nazwisko]],2,FALSE)<>0,VLOOKUP(B11,Tabela1[[Nick]:[Imię + Nazwisko]],2,FALSE),\"\"),\"\")","v":"Groul"},76,98.701298701298697,{"$f":"IF(B11<>\"\",IF(VLOOKUP(B11,Tabela1[[#All],[Imię + Nazwisko]:[K]],11,FALSE)=1,\"K\",\"\")&IF(VLOOKUP(B11,Tabela1[[#All],[Imię + Nazwisko]:[K]],10,FALSE)=1,\"W\",\"\"),\"\")","v":""},2,2,2,2,2,2,1,2,2,2,2,2,2,2,2,1,2,2,2,2,2,2,2,2,2,2,2,2,2,2,2,2,1,2,2,2,2,2,1,2,2]
[4,"Cielepak Tomasz",{"$f":"IF(NOT(B12=\"\"),IF(VLOOKUP(B12,Tabela1[[Nick]:[Imię + Nazwisko]],2,FALSE)<>0,VLOOKUP(B12,Tabela1[[Nick]:[Imię + Nazwisko]],2,FALSE),\"\"),\"\")","v":"MASZOT"},75,97.402597402597408,{"$f":"IF(B12<>\"\",IF(VLOOKUP(B12,Tabela1[[#All],[Imię + Nazwisko]:[K]],11,FALSE)=1,\"K\",\"\")&IF(VLOOKUP(B12,Tabela1[[#All],[Imię + Nazwisko]:[K]],10,FALSE)=1,\"W\",\"\"),\"\")","v":""},2,2,2,2,2,2,2,2,2,2,2,2,2,2,2,2,2,1,1,2,2,2,2,2,1,2,2,1,2,2,2,2,2,2,2,2,1,2,2,2]
[4,"Lisowski Grzegorz",{"$f":"IF(NOT(B13=\"\"),IF(VLOOKUP(B13,Tabela1[[Nick]:[Imię + Nazwisko]],2,FALSE)<>0,VLOOKUP(B13,Tabela1[[Nick]:[Imię + Nazwisko]],2,FALSE),\"\"),\"\")","v":"Lisek"},75,97.402597402597408,{"$f":"IF(B13<>\"\",IF(VLOOKUP(B13,Tabela1[[#All],[Imię + Nazwisko]:[K]],11,FALSE)=1,\"K\",\"\")&IF(VLOOKUP(B13,Tabela1[[#All],[Imię + Nazwisko]:[K]],10,FALSE)=1,\"W\",\"\"),\"\")","v":""},2,2,2,2,2,2,2,2,1,2,2,2,2,2,2,2,2,2,1,1,2,2,2,2,2,2,2,1,2,2,2,2,2,2,2,2,2,2,1,2]
[6,"Szałkowski Krzysztof",{"$f":"IF(NOT(B14=\"\"),IF(VLOOKUP(B14,Tabela1[[Nick]:[Imię + Nazwisko]],2,FALSE)<>0,VLOOKUP(B14,Tabela1[[Nick]:[Imię + Nazwisko]],2,FALSE),\"\"),\"\")","v":"Kris"},72,93.506493506493499,{"$f":"IF(B14<>\"\",IF(VLOOKUP(B14,Tabela1[[#All],[Imię + Nazwisko]:[K]],11,FALSE)=1,\"K\",\"\")&IF(VLOOKUP(B14,Tabela1[[#All],[Imię + Nazwisko]:[K]],10,FALSE)=1,\"W\",\"\"),\"\")","v":""},2,2,2,2,2,2,2,2,2,2,2,1,2,1,2,1,2,2,1,2,2,2,2,2,1,2,1,1,2,2,2,1,2,2,2,2,2,2,2,2]
[6,"Wolski Robert",{"$f":"IF(NOT(B15=\"\"),IF(VLOOKUP(B15,Tabela1[[Nick]:[Imię + Nazwisko]],2,FALSE)<>0,VLOOKUP(B15,Tabela1[[Nick]:[Imię + Nazwisko]],2,FALSE),\"\"),\"\")","v":"Wola"},72,93.506493506493499,{"$f":"IF(B15<>\"\",IF(VLOOKUP(B15,Tabela1[[#All],[Imię + Nazwisko]:[K]],11,FALSE)=1,\"K\",\"\")&IF(VLOOKUP(B15,Tabela1[[#All],[Imię + Nazwisko]:[K]],10,FALSE)=1,\"W\",\"\"),\"\")","v":""},2,2,2,2,2,2,2,1,2,1,2,2,1,2,1,1,2,1,2,2,2,1,2,2,2,2,2,1,2,2,2,2,2,2,2,2,2,2,2,2]
[8,"Szłapka Maciej",{"$f":"IF(NOT(B16=\"\"),IF(VLOOKUP(B16,Tabela1[[Nick]:[Imię + Nazwisko]],2,FALSE)<>0,VLOOKUP(B16,Tabela1[[Nick]:[Imię + Nazwisko]],2,FALSE),\"\"),\"\")","v":"MaciejSz"},71,92.20779220779221,{"$f":"IF(B16<>\"\",IF(VLOOKUP(B16,Tabela1[[#All],[Imię + Nazwisko]:[K]],11,FALSE)=1,\"K\",\"\")&IF(VLOOKUP(B16,Tabela1[[#All],[Imię + Nazwisko]:[K]],10,FALSE)=1,\"W\",\"\"),\"\")","v":""},2,2,2,1,2,2,2,2,2,1,2,2,2,2,1,2,2,2,1,1,2,2,2,2,2,2,1,1,2,2,2,2,2,2,2,2,2,1,2,1]
[8,"Remiszewski Piotr",{"$f":"IF(NOT(B17=\"\"),IF(VLOOKUP(B17,Tabela1[[Nick]:[Imię + Nazwisko]],2,FALSE)<>0,VLOOKUP(B17,Tabela1[[Nick]:[Imię + Nazwisko]],2,FALSE),\"\"),\"\")","v":"red5555"},71,92.20779220779221,{"$f":"IF(B17<>\"\",IF(VLOOKUP(B17,Tabela1[[#All],[Imię + Nazwisko]:[K]],11,FALSE)=1,\"K\",\"\")&IF(VLOOKUP(B17,Tabela1[[#All],[Imię + Nazwisko]:[K]],10,FALSE)=1,\"W\",\"\"),\"\")","v":""},2,2,2,2,2,2,2,2,2,1,2,2,1,2,1,1,2,2,1,0,2,2,2,2,2,2,2,2,2,2,2,2,2,2,1,2,2,2,1,2]
[10,"Kowalczyk Krzysztof",{"$f":"IF(NOT(B18=\"\"),IF(VLOOKUP(B18,Tabela1[[Nick]:[Imię + Nazwisko]],2,FALSE)<>0,VLOOKUP(B18,Tabela1[[Nick]:[Imię + Nazwisko]],2,FALSE),\"\"),\"\")","v":"krzysztofk"},69,89.610389610389603,{"$f":"IF(B18<>\"\",IF(VLOOKUP(B18,Tabela1[[#All],[Imię + Nazwisko]:[K]],11,FALSE)=1,\"K\",\"\")&IF(VLOOKUP(B18,Tabela1[[#All],[Imię + Nazwisko]:[K]],10,FALSE)=1,\"W\",\"\"),\"\")","v":""},2,2,2,2,2,2,2,2,2,1,2,2,2,2,1,1,2,2,1,1,2,2,2,2,2,1,1,0,2,1,2,2,2,2,2,2,2,2,1,2]
[10,"Kaczmarek Mariusz",{"$f":"IF(NOT(B19=\"\"),IF(VLOOKUP(B19,Tabela1[[Nick]:[Imię + Nazwisko]],2,FALSE)<>0,VLOOKUP(B19,Tabela1[[Nick]:[Imię + Nazwisko]],2,FALSE),\"\"),\"\")","v":"Mario_64"},69,89.610389610389603,{"$f":"IF(B19<>\"\",IF(VLOOKUP(B19,Tabela1[[#All],[Imię + Nazwisko]:[K]],11,FALSE)=1,\"K\",\"\")&IF(VLOOKUP(B19,Tabela1[[#All],[Imię + Nazwisko]:[K]],10,FALSE)=1,\"W\",\"\"),\"\")","v":""},2,2,2,2,2,2,1,1,2,2,2,2,2,2,2,2,2,2,2,1,2,2,2,1,2,2,1,1,2,2,1,2,1,2,1,1,2,2,1,2]
[12,"Krempczyński Marek",{"$f":"IF(NOT(B20=\"\"),IF(VLOOKUP(B20,Tabela1[[Nick]:[Imię + Nazwisko]],2,FALSE)<>0,VLOOKUP(B20,Tabela1[[Nick]:[Imię + Nazwisko]],2,FALSE),\"\"),\"\")","v":"Łysy"},68,88.311688311688314,{"$f":"IF(B20<>\"\",IF(VLOOKUP(B20,Tabela1[[#All],[Imię + Nazwisko]:[K]],11,FALSE)=1,\"K\",\"\")&IF(VLOOKUP(B20,Tabela1[[#All],[Imię + Nazwisko]:[K]],10,FALSE)=1,\"W\",\"\"),\"\")","v":""},2,2,2,2,1,2,2,2,2,1,2,2,2,2,2,1,2,2,1,1,2,2,2,2,2,1,0,1,2,2,0,2,2,2,2,2,2,2,1,2]
[12,"Korpalski Artur",{"$f":"IF(NOT(B21=\"\"),IF(VLOOKUP(B21,Tabela1[[Nick]:[Imię + Nazwisko]],2,FALSE)<>0,VLOOKUP(B21,Tabela1[[Nick]:[Imię + Nazwisko]],2,FALSE),\"\"),\"\")","v":"Artkor"},68,88.311688311688314,{"$f":"IF(B21<>\"\",IF(VLOOKUP(B21,Tabela1[[#All],[Imię + Nazwisko]:[K]],11,FALSE)=1,\"K\",\"\")&IF(VLOOKUP(B21,Tabela1[[#All],[Imię + Nazwisko]:[K]],10,FALSE)=1,\"W\",\"\"),\"\")","v":""},2,2,1,2,1,2,2,2,2,2,2,0,2,2,2,1,2,2,1,1,2,2,2,2,2,2,1,0,2,1,2,2,2,2,2,2,2,2,2,1]
[12,"Zacharzewski Arkadiusz",{"$f":"IF(NOT(B22=\"\"),IF(VLOOKUP(B22,Tabela1[[Nick]:[Imię + Nazwisko]],2,FALSE)<>0,VLOOKUP(B22,Tabela1[[Nick]:[Imię + Nazwisko]],2,FALSE),\"\"),\"\")","v":"Rek"},68,88.311688311688314,{"$f":"IF(B22<>\"\",IF(VLOOKUP(B22,Tabela1[[#All],[Imię + Nazwisko]:[K]],11,FALSE)=1,\"K\",\"\")&IF(VLOOKUP(B22,Tabela1[[#All],[Imię + Nazwisko]:[K]],10,FALSE)=1,\"W\",\"\"),\"\")","v":""},2,2,2,2,2,2,2,2,2,2,1,2,1,2,2,1,2,2,1,1,2,2,2,1,2,2,1,1,1,2,2,2,1,2,0,2,2,2,2,2]
[15,"Maciejewicz Mirosław",{"$f":"IF(NOT(B23=\"\"),IF(VLOOKUP(B23,Tabela1[[Nick]:[Imię + Nazwisko]],2,FALSE)<>0,VLOOKUP(B23,Tabela1[[Nick]:[Imię + Nazwisko]],2,FALSE),\"\"),\"\")","v":"Krauser"},67,87.012987012987011,{"$f":"IF(B23<>\"\",IF(VLOOKUP(B23,Tabela1[[#All],[Imię + Nazwisko]:[K]],11,FALSE)=1,\"K\",\"\")&IF(VLOOKUP(B23,Tabela1[[#All],[Imię + Nazwisko]:[K]],10,FALSE)=1,\"W\",\"\"),\"\")","v":""},2,2,2,2,1,2,1,2,2,2,2,2,2,2,2,1,2,1,2,1,2,2,1,1,2,1,2,2,1,2,1,2,1,2,1,2,2,1,2,2]
[15,"Kerber Jakub",{"$f":"IF(NOT(B24=\"\"),IF(VLOOKUP(B24,Tabela1[[Nick]:[Imię + Nazwisko]],2,FALSE)<>0,VLOOKUP(B24,Tabela1[[Nick]:[Imię + Nazwisko]],2,FALSE),\"\"),\"\")","v":"Lord Rzeźnik"},67,87.012987012987011,{"$f":"IF(B24<>\"\",IF(VLOOKUP(B24,Tabela1[[#All],[Imię + Nazwisko]:[K]],11,FALSE)=1,\"K\",\"\")&IF(VLOOKUP(B24,Tabela1[[#All],[Imię + Nazwisko]:[K]],10,FALSE)=1,\"W\",\"\"),\"\")","v":""},2,1,2,2,2,2,2,2,2,2,1,1,2,2,2,1,2,1,1,1,2,2,2,2,1,1,1,1,2,2,2,2,2,2,1,2,2,1,2,2]
[17,"Białek Józef",{"$f":"IF(NOT(B25=\"\"),IF(VLOOKUP(B25,Tabela1[[Nick]:[Imię + Nazwisko]],2,FALSE)<>0,VLOOKUP(B25,Tabela1[[Nick]:[Imię + Nazwisko]],2,FALSE),\"\"),\"\")","v":"Josef"},66,85.714285714285708,{"$f":"IF(B25<>\"\",IF(VLOOKUP(B25,Tabela1[[#All],[Imię + Nazwisko]:[K]],11,FALSE)=1,\"K\",\"\")&IF(VLOOKUP(B25,Tabela1[[#All],[Imię + Nazwisko]:[K]],10,FALSE)=1,\"W\",\"\"),\"\")","v":"W"},2,2,1,2,2,2,1,2,2,2,1,2,2,2,2,1,2,2,1,1,2,1,2,2,1,2,1,2,1,2,1,2,2,2,0,1,2,2,2,2]
[17,"Wietrzykowski Paweł",{"$f":"IF(NOT(B26=\"\"),IF(VLOOKUP(B26,Tabela1[[Nick]:[Imię + Nazwisko]],2,FALSE)<>0,VLOOKUP(B26,Tabela1[[Nick]:[Imię + Nazwisko]],2,FALSE),\"\"),\"\")","v":"PawełW"},66,85.714285714285708,{"$f":"IF(B26<>\"\",IF(VLOOKUP(B26,Tabela1[[#All],[Imię + Nazwisko]:[K]],11,FALSE)=1,\"K\",\"\")&IF(VLOOKUP(B26,Tabela1[[#All],[Imię + Nazwisko]:[K]],10,FALSE)=1,\"W\",\"\"),\"\")","v":""},2,2,1,1,2,2,2,1,2,1,1,2,1,2,2,1,1,2,1,1,2,2,2,2,2,1,1,1,2,1,2,2,2,2,2,2,2,2,2,2]
[17,"Krystek Jacek",{"$f":"IF(NOT(B27=\"\"),IF(VLOOKUP(B27,Tabela1[[Nick]:[Imię + Nazwisko]],2,FALSE)<>0,VLOOKUP(B27,Tabela1[[Nick]:[Imię + Nazwisko]],2,FALSE),\"\"),\"\")","v":"zantara"},66,85.714285714285708,{"$f":"IF(B27<>\"\",IF(VLOOKUP(B27,Tabela1[[#All],[Imię + Nazwisko]:[K]],11,FALSE)=1,\"K\",\"\")&IF(VLOOKUP(B27,Tabela1[[#All],[Imię + Nazwisko]:[K]],10,FALSE)=1,\"W\",\"\"),\"\")","v":""},2,1,2,2,1,2,2,2,2,1,1,2,2,2,2,2,2,2,2,1,2,2,2,1,1,2,1,1,2,2,2,2,1,2,0,2,2,1,1,2]
[20,"Dominiak Mateusz",{"$f":"IF(NOT(B28=\"\"),IF(VLOOKUP(B28,Tabela1[[Nick]:[Imię + Nazwisko]],2,FALSE)<>0,VLOOKUP(B28,Tabela1[[Nick]:[Imię + Nazwisko]],2,FALSE),\"\"),\"\")","v":"Domin"},65,84.415584415584405,{"$f":"IF(B28<>\"\",IF(VLOOKUP(B28,Tabela1[[#All],[Imię + Nazwisko]:[K]],11,FALSE)=1,\"K\",\"\")&IF(VLOOKUP(B28,Tabela1[[#All],[Imię + Nazwisko]:[K]],10,FALSE)=1,\"W\",\"\"),\"\")","v":""},2,2,1,2,1,1,2,2,2,2,2,1,2,2,2,1,2,1,1,1,2,2,2,1,2,2,2,0,1,2,2,2,2,2,1,2,1,2,1,2]
[20,"Machowicz Krzysztof",{"$f":"IF(NOT(B29=\"\"),IF(VLOOKUP(B29,Tabela1[[Nick]:[Imię + Nazwisko]],2,FALSE)<>0,VLOOKUP(B29,Tabela1[[Nick]:[Imię + Nazwisko]],2,FALSE),\"\"),\"\")","v":"yamrt"},65,84.415584415584405,{"$f":"IF(B29<>\"\",IF(VLOOKUP(B29,Tabela1[[#All],[Imię + Nazwisko]:[K]],11,FALSE)=1,\"K\",\"\")&IF(VLOOKUP(B29,Tabela1[[#All],[Imię + Nazwisko]:[K]],10,FALSE)=1,\"W\",\"\"),\"\")","v":""},2,2,2,1,2,2,2,2,2,2,2,0,1,2,1,1,2,2,2,1,2,2,2,2,2,2,1,1,1,2,1,1,1,2,1,2,1,2,2,2]
[22,"Sadowski Eugeniusz",{"$f":"IF(NOT(B30=\"\"),IF(VLOOKUP(B30,Tabela1[[Nick]:[Imię + Nazwisko]],2,FALSE)<>0,VLOOKUP(B30,Tabela1[[Nick]:[Imię + Nazwisko]],2,FALSE),\"\"),\"\")","v":"eugsad"},64,83.116883116883116,{"$f":"IF(B30<>\"\",IF(VLOOKUP(B30,Tabela1[[#All],[Imię + Nazwisko]:[K]],11,FALSE)=1,\"K\",\"\")&IF(VLOOKUP(B30,Tabela1[[#All],[Imię + Nazwisko]:[K]],10,FALSE)=1,\"W\",\"\"),\"\")","v":"W"},2,2,2,2,1,2,2,2,2,2,2,1,2,2,1,1,2,2,1,1,1,2,2,1,1,1,2,0,1,2,2,2,1,2,2,1,2,2,1,2]
[22,"Wziętek Marek",{"$f":"IF(NOT(B31=\"\"),IF(VLOOKUP(B31,Tabela1[[Nick]:[Imię + Nazwisko]],2,FALSE)<>0,VLOOKUP(B31,Tabela1[[Nick]:[Imię + Nazwisko]],2,FALSE),\"\"),\"\")","v":"Maruch"},64,83.116883116883116,{"$f":"IF(B31<>\"\",IF(VLOOKUP(B31,Tabela1[[#All],[Imię + Nazwisko]:[K]],11,FALSE)=1,\"K\",\"\")&IF(VLOOKUP(B31,Tabela1[[#All],[Imię + Nazwisko]:[K]],10,FALSE)=1,\"W\",\"\"),\"\")","v":""},2,1,2,2,2,2,2,2,2,2,1,2,2,1,1,1,1,2,1,1,1,2,2,1,2,1,0,2,2,2,1,2,2,2,2,2,2,1,1,2]
[22,"Brandys Piotr",{"$f":"IF(NOT(B32=\"\"),IF(VLOOKUP(B32,Tabela1[[Nick]:[Imię + Nazwisko]],2,FALSE)<>0,VLOOKUP(B32,Tabela1[[Nick]:[Imię + Nazwisko]],2,FALSE),\"\"),\"\")","v":"Brandon"},64,83.116883116883116,{"$f":"IF(B32<>\"\",IF(VLOOKUP(B32,Tabela1[[#All],[Imię + Nazwisko]:[K]],11,FALSE)=1,\"K\",\"\")&IF(VLOOKUP(B32,Tabela1[[#All],[Imię + Nazwisko]:[K]],10,FALSE)=1,\"W\",\"\"),\"\")","v":""},2,2,2,1,2,2,2,2,1,1,1,1,2,2,1,2,2,1,1,1,2,2,2,2,1,1,1,1,1,2,1,2,2,2,2,1,2,2,2,2]
[22,"Gacek Tomasz",{"$f":"IF(NOT(B33=\"\"),IF(VLOOKUP(B33,Tabela1[[Nick]:[Imię + Nazwisko]],2,FALSE)<>0,VLOOKUP(B33,Tabela1[[Nick]:[Imię + Nazwisko]],2,FALSE),\"\"),\"\")","v":"WuDe"},64,83.116883116883116,{"$f":"IF(B33<>\"\",IF(VLOOKUP(B33,Tabela1[[#All],[Imię + Nazwisko]:[K]],11,FALSE)=1,\"K\",\"\")&IF(VLOOKUP(B33,Tabela1[[#All],[Imię + Nazwisko]:[K]],10,FALSE)=1,\"W\",\"\"),\"\")","v":""},2,2,2,2,1,2,2,2,2,2,1,0,2,1,2,2,2,2,1,1,1,1,2,2,2,2,1,1,2,2,2,1,1,2,2,2,1,1,1,2]
[22,"Szymanowski Darek",{"$f":"IF(NOT(B34=\"\"),IF(VLOOKUP(B34,Tabela1[[Nick]:[Imię + Nazwisko]],2,FALSE)<>0,VLOOKUP(B34,Tabela1[[Nick]:[Imię + Nazwisko]],2,FALSE),\"\"),\"\")","v":"sindbad"},64,83.116883116883116,{"$f":"IF(B34<>\"\",IF(VLOOKUP(B34,Tabela1[[#All],[Imię + Nazwisko]:[K]],11,FALSE)=1,\"K\",\"\")&IF(VLOOKUP(B34,Tabela1[[#All],[Imię + Nazwisko]:[K]],10,FALSE)=1,\"W\",\"\"),\"\")","v":""},2,1,2,2,1,2,2,2,1,2,1,1,1,2,1,2,2,1,1,2,1,2,2,2,2,2,0,1,2,2,1,2,2,2,2,2,2,1,1,2]
[27,"Kaźmierczak Bartłomiej",{"$f":"IF(NOT(B35=\"\"),IF(VLOOKUP(B35,Tabela1[[Nick]:[Imię + Nazwisko]],2,FALSE)<>0,VLOOKUP(B35,Tabela1[[Nick]:[Imię + Nazwisko]],2,FALSE),\"\"),\"\")","v":"BARTEZZ"},63,81.818181818181827,{"$f":"IF(B35<>\"\",IF(VLOOKUP(B35,Tabela1[[#All],[Imię + Nazwisko]:[K]],11,FALSE)=1,\"K\",\"\")&IF(VLOOKUP(B35,Tabela1[[#All],[Imię + Nazwisko]:[K]],10,FALSE)=1,\"W\",\"\"),\"\")","v":""},2,2,2,1,1,2,2,2,2,2,1,2,2,2,2,1,2,2,1,1,1,1,2,1,2,2,1,1,1,2,2,1,1,2,2,2,2,2,1,0]
[27,"Wołowicz Krzysztof",{"$f":"IF(NOT(B36=\"\"),IF(VLOOKUP(B36,Tabela1[[Nick]:[Imię + Nazwisko]],2,FALSE)<>0,VLOOKUP(B36,Tabela1[[Nick]:[Imię + Nazwisko]],2,FALSE),\"\"),\"\")","v":"Piżol"},63,81.818181818181827,{"$f":"IF(B36<>\"\",IF(VLOOKUP(B36,Tabela1[[#All],[Imię + Nazwisko]:[K]],11,FALSE)=1,\"K\",\"\")&IF(VLOOKUP(B36,Tabela1[[#All],[Imię + Nazwisko]:[K]],10,FALSE)=1,\"W\",\"\"),\"\")","v":""},2,2,2,2,2,2,1,2,1,1,2,2,1,1,1,2,2,2,0,1,2,2,2,2,2,2,2,1,2,1,2,2,1,2,0,2,2,1,0,2]
[29,"Mazurek Karol",{"$f":"IF(NOT(B37=\"\"),IF(VLOOKUP(B37,Tabela1[[Nick]:[Imię + Nazwisko]],2,FALSE)<>0,VLOOKUP(B37,Tabela1[[Nick]:[Imię + Nazwisko]],2,FALSE),\"\"),\"\")","v":"lupus"},62,80.519480519480524,{"$f":"IF(B37<>\"\",IF(VLOOKUP(B37,Tabela1[[#All],[Imię + Nazwisko]:[K]],11,FALSE)=1,\"K\",\"\")&IF(VLOOKUP(B37,Tabela1[[#All],[Imię + Nazwisko]:[K]],10,FALSE)=1,\"W\",\"\"),\"\")","v":""},2,2,2,2,1,1,1,2,2,2,0,2,2,2,1,2,2,2,2,1,1,1,1,2,1,2,1,1,2,2,2,2,1,2,1,1,1,2,2,1]
[29,"Machowicz Anna",{"$f":"IF(NOT(B38=\"\"),IF(VLOOKUP(B38,Tabela1[[Nick]:[Imię + Nazwisko]],2,FALSE)<>0,VLOOKUP(B38,Tabela1[[Nick]:[Imię + Nazwisko]],2,FALSE),\"\"),\"\")","v":"Anna"},62,80.519480519480524,{"$f":"IF(B38<>\"\",IF(VLOOKUP(B38,Tabela1[[#All],[Imię + Nazwisko]:[K]],11,FALSE)=1,\"K\",\"\")&IF(VLOOKUP(B38,Tabela1[[#All],[Imię + Nazwisko]:[K]],10,FALSE)=1,\"W\",\"\"),\"\")","v":"K"},2,1,2,2,1,2,1,2,2,1,1,2,1,2,1,1,2,1,1,1,2,1,2,2,2,2,0,1,2,2,2,2,2,2,1,1,2,2,1,2]
[31,"Sawicki Leszek",{"$f":"IF(NOT(B39=\"\"),IF(VLOOKUP(B39,Tabela1[[Nick]:[Imię + Nazwisko]],2,FALSE)<>0,VLOOKUP(B39,Tabela1[[Nick]:[Imię + Nazwisko]],2,FALSE),\"\"),\"\")","v":"PaPaj"},61,79.220779220779221,{"$f":"IF(B39<>\"\",IF(VLOOKUP(B39,Tabela1[[#All],[Imię + Nazwisko]:[K]],11,FALSE)=1,\"K\",\"\")&IF(VLOOKUP(B39,Tabela1[[#All],[Imię + Nazwisko]:[K]],10,FALSE)=1,\"W\",\"\"),\"\")","v":""},2,2,2,2,2,2,1,1,1,1,1,1,0,1,1,1,2,2,1,2,2,2,2,2,1,2,1,1,1,2,2,2,1,2,2,2,2,1,2,1]
[32,"Dębecka Marta",{"$f":"IF(NOT(B40=\"\"),IF(VLOOKUP(B40,Tabela1[[Nick]:[Imię + Nazwisko]],2,FALSE)<>0,VLOOKUP(B40,Tabela1[[Nick]:[Imię + Nazwisko]],2,FALSE),\"\"),\"\")","v":"Lennox"},54,70.129870129870127,{"$f":"IF(B40<>\"\",IF(VLOOKUP(B40,Tabela1[[#All],[Imię + Nazwisko]:[K]],11,FALSE)=1,\"K\",\"\")&IF(VLOOKUP(B40,Tabela1[[#All],[Imię + Nazwisko]:[K]],10,FALSE)=1,\"W\",\"\"),\"\")","v":"K"},2,2,2,1,1,1,1,1,2,1,1,1,1,2,2,1,2,2,1,1,2,1,2,2,2,2,1,1,1,1,1,1,1,1,1,1,1,1,1,2]
[33,"Wietrzykowski Krzysztof",{"$f":"IF(NOT(B41=\"\"),IF(VLOOKUP(B41,Tabela1[[Nick]:[Imię + Nazwisko]],2,FALSE)<>0,VLOOKUP(B41,Tabela1[[Nick]:[Imię + Nazwisko]],2,FALSE),\"\"),\"\")","v":"Krzysztof W."},53,68.831168831168839,{"$f":"IF(B41<>\"\",IF(VLOOKUP(B41,Tabela1[[#All],[Imię + Nazwisko]:[K]],11,FALSE)=1,\"K\",\"\")&IF(VLOOKUP(B41,Tabela1[[#All],[Imię + Nazwisko]:[K]],10,FALSE)=1,\"W\",\"\"),\"\")","v":""},2,1,1,1,2,1,1,1,2,1,1,1,1,1,2,1,1,1,1,2,2,1,2,1,1,1,2,2,1,1,1,1,0,2,2,1,2,1,2,2]

{"sheet":"HFT2","index":2,"n_rows":16,"n_cols":47,"rows_kept":16,"cut":false,"hidden":false,"merged":[[6,0,6,1],[6,2,6,4],[0,3,0,5],[1,0,1,1],[1,3,1,5],[2,3,2,5],[3,0,3,1],[3,2,3,4],[3,6,3,46],[4,0,4,1],[4,2,4,4],[5,0,5,1],[5,2,5,4]]}
["Celów:",40,null,"% trafień za 2 pkt",null,null,{"$f":"(COUNTIF(G9:G74,2)/COUNTA(G9:G74))*100","v":87.5},{"$f":"(COUNTIF(H9:H74,2)/COUNTA(H9:H74))*100","v":50},75,50,50,75,62.5,87.5,50,50,37.5,62.5,37.5,50,37.5,12.5,62.5,50,0,0,25,37.5,62.5,25,37.5,37.5,37.5,37.5,37.5,25,37.5,62.5,25,87.5,37.5,62.5,50,50,37.5,75]
[null,null,null,"% trafień za 1 pkt",null,null,{"$f":"(COUNTIF(G9:G74,1)/COUNTA(G9:G74))*100","v":0},{"$f":"(COUNTIF(H9:H74,1)/COUNTA(H9:H74))*100","v":50},25,37.5,50,25,25,12.5,50,50,62.5,25,50,50,62.5,87.5,37.5,37.5,100,87.5,75,62.5,37.5,75,37.5,50,37.5,50,62.5,62.5,62.5,37.5,62.5,12.5,37.5,37.5,50,50,62.5,25]
[null,null,null,"% trafień za 0 pkt",null,null,{"$f":"(COUNTIF(G9:G74,0)/COUNTA(G9:G74))*100","v":12.5},{"$f":"(COUNTIF(H9:H74,0)/COUNTA(H9:H74))*100","v":0},0,12.5,0,0,12.5,0,0,0,0,12.5,12.5,0,0,0,0,12.5,0,12.5,0,0,0,0,25,12.5,25,12.5,0,12.5,0,0,12.5,0,25,0,0,0,0,0]
[]
[null,null,null,null,null,"Cel nr",1,2,3,4,5,6,7,8,9,10,11,12,13,14,15,16,17,18,19,20,21,22,23,24,25,26,27,28,29,30,31,32,33,34,35,36,37,38,39,40,"D"]
["Data:",null,43611,null,null,"dystans [m]",23,20,22.5,37,18,30,42,38,9,32,37,42,38,32,24,30,33,42,31,30,19,21,25,21,40,33,30,32,22,37,33,24,41,19,34,22.5,19,27,31,16]
["Kategoria:",null,"HFT2",null,null,"KZ [mm]",15,20,20,25,15,25,35,40,20,30,25,40,35,30,35,40,25,35,35,40,15,20,20,15,40,25,40,35,15,30,30,20,35,15,25,15,15,20,35,35]
["Miejsce","Imię, nazwisko","Nick","Suma punktów","% do zwycięzcy","postawa/ uwagi",null,null,"L","L",null,null,null,null,null,null,null,null,null,null,"kl","kl",null,null,"st","st",null,null,"L","L",null,null,"st","st",null,null,null,null,null,null,"m",null,null,null,"kl","kl"]
[1,"Opiela Sławomir",{"$f":"IF(NOT(B9=\"\"),IF(VLOOKUP(B9,Tabela1[[Nick]:[Imię + Nazwisko]],2,FALSE)<>0,VLOOKUP(B9,Tabela1[[Nick]:[Imię + Nazwisko]],2,FALSE),\"\"),\"\")","v":"AJU"},{"$f":"SUM(G9:AT9)","v":67},{"$f":"IF(A9=1,100,IF($D$9<>0,D9/$D$9*100,\"\"))","v":100},{"$f":"IF(B9<>\"\",IF(VLOOKUP(B9,Tabela1[[#All],[Imię + Nazwisko]:[K]],11,FALSE)=1,\"K\",\"\")&IF(VLOOKUP(B9,Tabela1[[#All],[Imię + Nazwisko]:[K]],10,FALSE)=1,\"W\",\"\"),\"\")","v":""},2,2,2,1,2,2,2,2,1,2,2,2,2,2,2,1,2,2,1,1,1,2,2,1,1,2,1,2,2,1,1,2,2,2,2,2,1,1,2,2]
[2,"Budny Artur",{"$f":"IF(NOT(B10=\"\"),IF(VLOOKUP(B10,Tabela1[[Nick]:[Imię + Nazwisko]],2,FALSE)<>0,VLOOKUP(B10,Tabela1[[Nick]:[Imię + Nazwisko]],2,FALSE),\"\"),\"\")","v":"Artur555"},63,94.029850746268664,{"$f":"IF(B10<>\"\",IF(VLOOKUP(B10,Tabela1[[#All],[Imię + Nazwisko]:[K]],11,FALSE)=1,\"K\",\"\")&IF(VLOOKUP(B10,Tabela1[[#All],[Imię + Nazwisko]:[K]],10,FALSE)=1,\"W\",\"\"),\"\")","v":""},2,2,2,1,1,2,2,2,2,2,1,2,2,2,1,1,2,2,1,1,1,1,1,1,1,1,2,1,1,2,2,2,1,2,2,2,2,2,1,2]
[3,"Chojnicki Janusz",{"$f":"IF(NOT(B11=\"\"),IF(VLOOKUP(B11,Tabela1[[Nick]:[Imię + Nazwisko]],2,FALSE)<>0,VLOOKUP(B11,Tabela1[[Nick]:[Imię + Nazwisko]],2,FALSE),\"\"),\"\")","v":"Spinner"},61,91.044776119402982,{"$f":"IF(B11<>\"\",IF(VLOOKUP(B11,Tabela1[[#All],[Imię + Nazwisko]:[K]],11,FALSE)=1,\"K\",\"\")&IF(VLOOKUP(B11,Tabela1[[#All],[Imię + Nazwisko]:[K]],10,FALSE)=1,\"W\",\"\"),\"\")","v":"W"},2,2,1,2,2,2,1,2,2,1,2,1,1,2,2,1,1,1,1,1,1,2,2,2,0,1,2,1,2,1,2,1,1,2,1,2,2,2,2,2]
[4,"Kaczmarek Piotr",{"$f":"IF(NOT(B12=\"\"),IF(VLOOKUP(B12,Tabela1[[Nick]:[Imię + Nazwisko]],2,FALSE)<>0,VLOOKUP(B12,Tabela1[[Nick]:[Imię + Nazwisko]],2,FALSE),\"\"),\"\")","v":"Silart"},60,89.552238805970148,{"$f":"IF(B12<>\"\",IF(VLOOKUP(B12,Tabela1[[#All],[Imię + Nazwisko]:[K]],11,FALSE)=1,\"K\",\"\")&IF(VLOOKUP(B12,Tabela1[[#All],[Imię + Nazwisko]:[K]],10,FALSE)=1,\"W\",\"\"),\"\")","v":""},2,1,2,1,2,2,1,2,1,1,1,1,2,1,1,1,2,2,1,1,2,1,2,2,2,1,2,2,2,1,2,2,1,2,0,2,1,2,1,2]
[5,"Badziński Sławomir",{"$f":"IF(NOT(B13=\"\"),IF(VLOOKUP(B13,Tabela1[[Nick]:[Imię + Nazwisko]],2,FALSE)<>0,VLOOKUP(B13,Tabela1[[Nick]:[Imię + Nazwisko]],2,FALSE),\"\"),\"\")","v":"slawol75"},57,85.074626865671647,{"$f":"IF(B13<>\"\",IF(VLOOKUP(B13,Tabela1[[#All],[Imię + Nazwisko]:[K]],11,FALSE)=1,\"K\",\"\")&IF(VLOOKUP(B13,Tabela1[[#All],[Imię + Nazwisko]:[K]],10,FALSE)=1,\"W\",\"\"),\"\")","v":""},2,2,1,2,1,1,2,2,2,2,1,2,1,1,1,1,1,2,1,1,1,2,2,1,2,2,1,0,1,1,1,2,1,2,2,2,1,1,2,1]
[6,"Floryn Marek",{"$f":"IF(NOT(B14=\"\"),IF(VLOOKUP(B14,Tabela1[[Nick]:[Imię + Nazwisko]],2,FALSE)<>0,VLOOKUP(B14,Tabela1[[Nick]:[Imię + Nazwisko]],2,FALSE),\"\"),\"\")","v":"StgMechanik"},55,82.089552238805979,{"$f":"IF(B14<>\"\",IF(VLOOKUP(B14,Tabela1[[#All],[Imię + Nazwisko]:[K]],11,FALSE)=1,\"K\",\"\")&IF(VLOOKUP(B14,Tabela1[[#All],[Imię + Nazwisko]:[K]],10,FALSE)=1,\"W\",\"\"),\"\")","v":"W"},0,1,2,2,2,2,2,2,1,1,1,2,1,1,2,1,2,1,1,1,1,1,1,1,2,2,0,1,1,1,1,2,2,2,1,1,2,2,1,2]
[7,"Zgiernicki Marcin",{"$f":"IF(NOT(B15=\"\"),IF(VLOOKUP(B15,Tabela1[[Nick]:[Imię + Nazwisko]],2,FALSE)<>0,VLOOKUP(B15,Tabela1[[Nick]:[Imię + Nazwisko]],2,FALSE),\"\"),\"\")","v":"Mazgier"},54,80.597014925373131,{"$f":"IF(B15<>\"\",IF(VLOOKUP(B15,Tabela1[[#All],[Imię + Nazwisko]:[K]],11,FALSE)=1,\"K\",\"\")&IF(VLOOKUP(B15,Tabela1[[#All],[Imię + Nazwisko]:[K]],10,FALSE)=1,\"W\",\"\"),\"\")","v":""},2,1,2,2,1,2,2,2,1,2,2,2,1,2,1,2,2,1,1,1,1,1,2,1,1,1,0,2,1,2,1,1,1,1,0,1,2,1,1,1]
[8,"Lamcha Marcin",{"$f":"IF(NOT(B16=\"\"),IF(VLOOKUP(B16,Tabela1[[Nick]:[Imię + Nazwisko]],2,FALSE)<>0,VLOOKUP(B16,Tabela1[[Nick]:[Imię + Nazwisko]],2,FALSE),\"\"),\"\")","v":"Lamus"},36,53.731343283582092,{"$f":"IF(B16<>\"\",IF(VLOOKUP(B16,Tabela1[[#All],[Imię + Nazwisko]:[K]],11,FALSE)=1,\"K\",\"\")&IF(VLOOKUP(B16,Tabela1[[#All],[Imię + Nazwisko]:[K]],10,FALSE)=1,\"W\",\"\"),\"\")","v":""},2,1,2,0,1,1,0,1,2,1,1,0,0,1,1,1,1,0,1,0,2,1,1,1,0,0,1,1,1,0,1,1,0,2,1,1,1,1,1,2]

{"sheet":"nHFT","index":3,"n_rows":25,"n_cols":47,"rows_kept":25,"cut":false,"hidden":false,"merged":[[6,0,6,1],[6,2,6,4],[0,3,0,5],[1,0,1,1],[1,3,1,5],[2,3,2,5],[3,0,3,1],[3,2,3,4],[3,6,3,46],[4,0,4,1],[4,2,4,4],[5,0,5,1],[5,2,5,4]]}
["Celów:",20,null,"% trafień za 2 pkt",null,null,{"$f":"(COUNTIF(G9:G74,2)/COUNTA(G9:G74))*100","v":94.117647058823522},{"$f":"(COUNTIF(H9:H74,2)/COUNTA(H9:H74))*100","v":76.470588235294116},82.35294117647058,64.705882352941174,58.82352941176471,76.470588235294116,76.470588235294116,76.470588235294116,82.35294117647058,88.235294117647058,52.941176470588239,35.294117647058826,52.941176470588239,82.35294117647058,94.117647058823522,94.117647058823522,76.470588235294116,94.117647058823522,76.470588235294116,64.705882352941174,{"$error":"#DIV/0!"},{"$error":"#DIV/0!"},{"$error":"#DIV/0!"},{"$error":"#DIV/0!"},{"$error":"#DIV/0!"},{"$error":"#DIV/0!"},{"$error":"#DIV/0!"},{"$error":"#DIV/0!"},{"$error":"#DIV/0!"},{"$error":"#DIV/0!"},{"$error":"#DIV/0!"},{"$error":"#DIV/0!"},{"$error":"#DIV/0!"},{"$error":"#DIV/0!"},{"$error":"#DIV/0!"},{"$error":"#DIV/0!"},{"$error":"#DIV/0!"},{"$error":"#DIV/0!"},{"$error":"#DIV/0!"},{"$error":"#DIV/0!"}]
[null,null,null,"% trafień za 1 pkt",null,null,{"$f":"(COUNTIF(G9:G74,1)/COUNTA(G9:G74))*100","v":5.8823529411764701},{"$f":"(COUNTIF(H9:H74,1)/COUNTA(H9:H74))*100","v":23.52941176470588},17.647058823529413,35.294117647058826,41.17647058823529,23.52941176470588,23.52941176470588,23.52941176470588,17.647058823529413,11.76470588235294,47.058823529411761,47.058823529411761,41.17647058823529,17.647058823529413,5.8823529411764701,5.8823529411764701,23.52941176470588,5.8823529411764701,23.52941176470588,35.294117647058826,{"$error":"#DIV/0!"},{"$error":"#DIV/0!"},{"$error":"#DIV/0!"},{"$error":"#DIV/0!"},{"$error":"#DIV/0!"},{"$error":"#DIV/0!"},{"$error":"#DIV/0!"},{"$error":"#DIV/0!"},{"$error":"#DIV/0!"},{"$error":"#DIV/0!"},{"$error":"#DIV/0!"},{"$error":"#DIV/0!"},{"$error":"#DIV/0!"},{"$error":"#DIV/0!"},{"$error":"#DIV/0!"},{"$error":"#DIV/0!"},{"$error":"#DIV/0!"},{"$error":"#DIV/0!"},{"$error":"#DIV/0!"},{"$error":"#DIV/0!"}]
[null,null,null,"% trafień za 0 pkt",null,null,{"$f":"(COUNTIF(G9:G74,0)/COUNTA(G9:G74))*100","v":0},{"$f":"(COUNTIF(H9:H74,0)/COUNTA(H9:H74))*100","v":0},0,0,0,0,0,0,0,0,0,17.647058823529413,5.8823529411764701,0,0,0,0,0,0,0,{"$error":"#DIV/0!"},{"$error":"#DIV/0!"},{"$error":"#DIV/0!"},{"$error":"#DIV/0!"},{"$error":"#DIV/0!"},{"$error":"#DIV/0!"},{"$error":"#DIV/0!"},{"$error":"#DIV/0!"},{"$error":"#DIV/0!"},{"$error":"#DIV/0!"},{"$error":"#DIV/0!"},{"$error":"#DIV/0!"},{"$error":"#DIV/0!"},{"$error":"#DIV/0!"},{"$error":"#DIV/0!"},{"$error":"#DIV/0!"},{"$error":"#DIV/0!"},{"$error":"#DIV/0!"},{"$error":"#DIV/0!"},{"$error":"#DIV/0!"}]
[]
[null,null,null,null,null,"Cel nr",1,2,3,4,5,6,7,8,9,10,11,12,13,14,15,16,17,18,19,20,21,22,23,24,25,26,27,28,29,30,31,32,33,34,35,36,37,38,39,40,"D"]
["Data:",null,43610,null,null,"dystans [m]",18.5,20,17,34,18,30,34,38,21,32,37,42,41,32,22.5,33,19,27,31,21]
["Kategoria:",null,"nHFT",null,null,"KZ [mm]",15,20,20,25,15,25,35,40,20,30,25,40,35,30,25,35,15,20,25,20]
["Miejsce","Imię, nazwisko","Nick","Suma punktów","% do zwycięzcy","postawa/ uwagi"]
[1,"Szłapka Maciej",{"$f":"IF(NOT(B9=\"\"),IF(VLOOKUP(B9,Tabela1[[Nick]:[Imię + Nazwisko]],2,FALSE)<>0,VLOOKUP(B9,Tabela1[[Nick]:[Imię + Nazwisko]],2,FALSE),\"\"),\"\")","v":"MaciejSz"},{"$f":"SUM(G9:AT9)","v":40},{"$f":"IF(A9=1,100,IF($D$9<>0,D9/$D$9*100,\"\"))","v":100},{"$f":"IF(B9<>\"\",IF(VLOOKUP(B9,Tabela1[[#All],[Imię + Nazwisko]:[K]],11,FALSE)=1,\"K\",\"\")&IF(VLOOKUP(B9,Tabela1[[#All],[Imię + Nazwisko]:[K]],10,FALSE)=1,\"W\",\"\"),\"\")","v":""},2,2,2,2,2,2,2,2,2,2,2,2,2,2,2,2,2,2,2,2]
[2,"Maciejewicz Mirosław",{"$f":"IF(NOT(B10=\"\"),IF(VLOOKUP(B10,Tabela1[[Nick]:[Imię + Nazwisko]],2,FALSE)<>0,VLOOKUP(B10,Tabela1[[Nick]:[Imię + Nazwisko]],2,FALSE),\"\"),\"\")","v":"Krauser"},39,97.5,{"$f":"IF(B10<>\"\",IF(VLOOKUP(B10,Tabela1[[#All],[Imię + Nazwisko]:[K]],11,FALSE)=1,\"K\",\"\")&IF(VLOOKUP(B10,Tabela1[[#All],[Imię + Nazwisko]:[K]],10,FALSE)=1,\"W\",\"\"),\"\")","v":""},2,2,2,2,2,2,2,2,2,2,2,2,1,2,2,2,2,2,2,2,null,null,null,null,null,null,null,null,null,null,null,null,null,null,null,null,null,null,null,null,1]
[3,"Lisowski Grzegorz",{"$f":"IF(NOT(B11=\"\"),IF(VLOOKUP(B11,Tabela1[[Nick]:[Imię + Nazwisko]],2,FALSE)<>0,VLOOKUP(B11,Tabela1[[Nick]:[Imię + Nazwisko]],2,FALSE),\"\"),\"\")","v":"Lisek"},39,97.5,{"$f":"IF(B11<>\"\",IF(VLOOKUP(B11,Tabela1[[#All],[Imię + Nazwisko]:[K]],11,FALSE)=1,\"K\",\"\")&IF(VLOOKUP(B11,Tabela1[[#All],[Imię + Nazwisko]:[K]],10,FALSE)=1,\"W\",\"\"),\"\")","v":""},2,2,2,2,2,2,2,2,2,2,1,2,2,2,2,2,2,2,2,2,null,null,null,null,null,null,null,null,null,null,null,null,null,null,null,null,null,null,null,null,2]
[4,"Cielepak Tomasz",{"$f":"IF(NOT(B12=\"\"),IF(VLOOKUP(B12,Tabela1[[Nick]:[Imię + Nazwisko]],2,FALSE)<>0,VLOOKUP(B12,Tabela1[[Nick]:[Imię + Nazwisko]],2,FALSE),\"\"),\"\")","v":"MASZOT"},38,95,{"$f":"IF(B12<>\"\",IF(VLOOKUP(B12,Tabela1[[#All],[Imię + Nazwisko]:[K]],11,FALSE)=1,\"K\",\"\")&IF(VLOOKUP(B12,Tabela1[[#All],[Imię + Nazwisko]:[K]],10,FALSE)=1,\"W\",\"\"),\"\")","v":""},2,2,2,2,2,2,2,2,2,2,1,2,2,2,2,2,1,2,2,2]
[4,"Remiszewski Piotr",{"$f":"IF(NOT(B13=\"\"),IF(VLOOKUP(B13,Tabela1[[Nick]:[Imię + Nazwisko]],2,FALSE)<>0,VLOOKUP(B13,Tabela1[[Nick]:[Imię + Nazwisko]],2,FALSE),\"\"),\"\")","v":"red5555"},38,95,{"$f":"IF(B13<>\"\",IF(VLOOKUP(B13,Tabela1[[#All],[Imię + Nazwisko]:[K]],11,FALSE)=1,\"K\",\"\")&IF(VLOOKUP(B13,Tabela1[[#All],[Imię + Nazwisko]:[K]],10,FALSE)=1,\"W\",\"\"),\"\")","v":""},2,2,2,2,1,2,2,2,2,2,2,1,2,2,2,2,2,2,2,2]
[6,"Szałkowski Krzysztof",{"$f":"IF(NOT(B14=\"\"),IF(VLOOKUP(B14,Tabela1[[Nick]:[Imię + Nazwisko]],2,FALSE)<>0,VLOOKUP(B14,Tabela1[[Nick]:[Imię + Nazwisko]],2,FALSE),\"\"),\"\")","v":"Kris"},36,90,{"$f":"IF(B14<>\"\",IF(VLOOKUP(B14,Tabela1[[#All],[Imię + Nazwisko]:[K]],11,FALSE)=1,\"K\",\"\")&IF(VLOOKUP(B14,Tabela1[[#All],[Imię + Nazwisko]:[K]],10,FALSE)=1,\"W\",\"\"),\"\")","v":""},2,2,2,1,2,2,2,1,2,2,2,0,2,2,2,2,2,2,2,2]
[6,"Sroczyński Michał",{"$f":"IF(NOT(B15=\"\"),IF(VLOOKUP(B15,Tabela1[[Nick]:[Imię + Nazwisko]],2,FALSE)<>0,VLOOKUP(B15,Tabela1[[Nick]:[Imię + Nazwisko]],2,FALSE),\"\"),\"\")","v":"Michał"},36,90,{"$f":"IF(B15<>\"\",IF(VLOOKUP(B15,Tabela1[[#All],[Imię + Nazwisko]:[K]],11,FALSE)=1,\"K\",\"\")&IF(VLOOKUP(B15,Tabela1[[#All],[Imię + Nazwisko]:[K]],10,FALSE)=1,\"W\",\"\"),\"\")","v":""},2,2,2,1,2,2,2,2,2,2,2,1,1,1,2,2,2,2,2,2]
[6,"Kerber Jakub",{"$f":"IF(NOT(B16=\"\"),IF(VLOOKUP(B16,Tabela1[[Nick]:[Imię + Nazwisko]],2,FALSE)<>0,VLOOKUP(B16,Tabela1[[Nick]:[Imię + Nazwisko]],2,FALSE),\"\"),\"\")","v":"Lord Rzeźnik"},36,90,{"$f":"IF(B16<>\"\",IF(VLOOKUP(B16,Tabela1[[#All],[Imię + Nazwisko]:[K]],11,FALSE)=1,\"K\",\"\")&IF(VLOOKUP(B16,Tabela1[[#All],[Imię + Nazwisko]:[K]],10,FALSE)=1,\"W\",\"\"),\"\")","v":""},2,2,2,2,2,1,2,2,2,1,2,1,1,2,2,2,2,2,2,2]
[6,"Dąbrowski Michał",{"$f":"IF(NOT(B17=\"\"),IF(VLOOKUP(B17,Tabela1[[Nick]:[Imię + Nazwisko]],2,FALSE)<>0,VLOOKUP(B17,Tabela1[[Nick]:[Imię + Nazwisko]],2,FALSE),\"\"),\"\")","v":"Michał Alfa"},36,90,{"$f":"IF(B17<>\"\",IF(VLOOKUP(B17,Tabela1[[#All],[Imię + Nazwisko]:[K]],11,FALSE)=1,\"K\",\"\")&IF(VLOOKUP(B17,Tabela1[[#All],[Imię + Nazwisko]:[K]],10,FALSE)=1,\"W\",\"\"),\"\")","v":""},2,2,2,1,2,2,1,2,2,2,1,1,2,2,2,2,2,2,2,2]
[10,"Kowalczyk Krzysztof",{"$f":"IF(NOT(B18=\"\"),IF(VLOOKUP(B18,Tabela1[[Nick]:[Imię + Nazwisko]],2,FALSE)<>0,VLOOKUP(B18,Tabela1[[Nick]:[Imię + Nazwisko]],2,FALSE),\"\"),\"\")","v":"krzysztofk"},35,87.5,{"$f":"IF(B18<>\"\",IF(VLOOKUP(B18,Tabela1[[#All],[Imię + Nazwisko]:[K]],11,FALSE)=1,\"K\",\"\")&IF(VLOOKUP(B18,Tabela1[[#All],[Imię + Nazwisko]:[K]],10,FALSE)=1,\"W\",\"\"),\"\")","v":""},2,1,2,2,2,2,1,2,2,2,2,1,2,2,2,2,1,2,2,1]
[11,"Kaźmierczak Bartłomiej",{"$f":"IF(NOT(B19=\"\"),IF(VLOOKUP(B19,Tabela1[[Nick]:[Imię + Nazwisko]],2,FALSE)<>0,VLOOKUP(B19,Tabela1[[Nick]:[Imię + Nazwisko]],2,FALSE),\"\"),\"\")","v":"BARTEZZ"},33,82.5,{"$f":"IF(B19<>\"\",IF(VLOOKUP(B19,Tabela1[[#All],[Imię + Nazwisko]:[K]],11,FALSE)=1,\"K\",\"\")&IF(VLOOKUP(B19,Tabela1[[#All],[Imię + Nazwisko]:[K]],10,FALSE)=1,\"W\",\"\"),\"\")","v":""},2,1,2,1,1,1,2,2,1,2,2,2,2,2,2,2,2,2,1,1]
[11,"Gacek Tomasz",{"$f":"IF(NOT(B20=\"\"),IF(VLOOKUP(B20,Tabela1[[Nick]:[Imię + Nazwisko]],2,FALSE)<>0,VLOOKUP(B20,Tabela1[[Nick]:[Imię + Nazwisko]],2,FALSE),\"\"),\"\")","v":"WuDe"},33,82.5,{"$f":"IF(B20<>\"\",IF(VLOOKUP(B20,Tabela1[[#All],[Imię + Nazwisko]:[K]],11,FALSE)=1,\"K\",\"\")&IF(VLOOKUP(B20,Tabela1[[#All],[Imię + Nazwisko]:[K]],10,FALSE)=1,\"W\",\"\"),\"\")","v":""},2,2,2,2,1,2,2,2,2,2,1,0,1,2,2,2,1,2,2,1]
[13,"Sadowski Eugeniusz",{"$f":"IF(NOT(B21=\"\"),IF(VLOOKUP(B21,Tabela1[[Nick]:[Imię + Nazwisko]],2,FALSE)<>0,VLOOKUP(B21,Tabela1[[Nick]:[Imię + Nazwisko]],2,FALSE),\"\"),\"\")","v":"eugsad"},32,80,{"$f":"IF(B21<>\"\",IF(VLOOKUP(B21,Tabela1[[#All],[Imię + Nazwisko]:[K]],11,FALSE)=1,\"K\",\"\")&IF(VLOOKUP(B21,Tabela1[[#All],[Imię + Nazwisko]:[K]],10,FALSE)=1,\"W\",\"\"),\"\")","v":"W"},2,1,1,2,1,2,2,2,1,2,1,1,1,2,2,2,2,2,2,1]
[13,"Zgiernicki Marcin",{"$f":"IF(NOT(B22=\"\"),IF(VLOOKUP(B22,Tabela1[[Nick]:[Imię + Nazwisko]],2,FALSE)<>0,VLOOKUP(B22,Tabela1[[Nick]:[Imię + Nazwisko]],2,FALSE),\"\"),\"\")","v":"Mazgier"},32,80,{"$f":"IF(B22<>\"\",IF(VLOOKUP(B22,Tabela1[[#All],[Imię + Nazwisko]:[K]],11,FALSE)=1,\"K\",\"\")&IF(VLOOKUP(B22,Tabela1[[#All],[Imię + Nazwisko]:[K]],10,FALSE)=1,\"W\",\"\"),\"\")","v":""},2,1,2,2,1,1,2,1,2,2,1,1,1,2,2,1,2,2,2,2]
[15,"Wolski Robert",{"$f":"IF(NOT(B23=\"\"),IF(VLOOKUP(B23,Tabela1[[Nick]:[Imię + Nazwisko]],2,FALSE)<>0,VLOOKUP(B23,Tabela1[[Nick]:[Imię + Nazwisko]],2,FALSE),\"\"),\"\")","v":"Wola"},31,77.5,{"$f":"IF(B23<>\"\",IF(VLOOKUP(B23,Tabela1[[#All],[Imię + Nazwisko]:[K]],11,FALSE)=1,\"K\",\"\")&IF(VLOOKUP(B23,Tabela1[[#All],[Imię + Nazwisko]:[K]],10,FALSE)=1,\"W\",\"\"),\"\")","v":""},2,2,1,1,2,2,1,2,2,2,2,0,0,2,1,2,2,2,1,2]
[15,"Dąbrowski Maciej",{"$f":"IF(NOT(B24=\"\"),IF(VLOOKUP(B24,Tabela1[[Nick]:[Imię + Nazwisko]],2,FALSE)<>0,VLOOKUP(B24,Tabela1[[Nick]:[Imię + Nazwisko]],2,FALSE),\"\"),\"\")","v":"Maciej Alfa"},31,77.5,{"$f":"IF(B24<>\"\",IF(VLOOKUP(B24,Tabela1[[#All],[Imię + Nazwisko]:[K]],11,FALSE)=1,\"K\",\"\")&IF(VLOOKUP(B24,Tabela1[[#All],[Imię + Nazwisko]:[K]],10,FALSE)=1,\"W\",\"\"),\"\")","v":""},2,2,2,1,1,1,1,1,2,2,1,2,2,1,2,2,2,2,1,1]
[17,"Korczyński Antoni",{"$f":"IF(NOT(B25=\"\"),IF(VLOOKUP(B25,Tabela1[[Nick]:[Imię + Nazwisko]],2,FALSE)<>0,VLOOKUP(B25,Tabela1[[Nick]:[Imię + Nazwisko]],2,FALSE),\"\"),\"\")","v":"Antek"},26,65,{"$f":"IF(B25<>\"\",IF(VLOOKUP(B25,Tabela1[[#All],[Imię + Nazwisko]:[K]],11,FALSE)=1,\"K\",\"\")&IF(VLOOKUP(B25,Tabela1[[#All],[Imię + Nazwisko]:[K]],10,FALSE)=1,\"W\",\"\"),\"\")","v":""},1,2,1,2,1,2,2,1,1,1,1,1,1,1,2,2,1,1,1,1]

{"sheet":"JUNIOR","index":4,"n_rows":10,"n_cols":47,"rows_kept":10,"cut":false,"hidden":false,"merged":[[6,0,6,1],[6,2,6,4],[0,3,0,5],[1,0,1,1],[1,3,1,5],[2,3,2,5],[3,0,3,1],[3,2,3,4],[3,6,3,46],[4,0,4,1],[4,2,4,4],[5,0,5,1],[5,2,5,4]]}
["Celów:",40,null,"% trafień za 2 pkt",null,null,{"$f":"(COUNTIF(G9:G74,2)/COUNTA(G9:G74))*100","v":100},{"$f":"(COUNTIF(H9:H74,2)/COUNTA(H9:H74))*100","v":50},50,0,50,0,50,0,0,0,0,0,0,0,0,0,50,50,0,0,50,50,50,50,0,0,0,0,50,0,50,50,50,50,50,100,50,50,0,0]
[null,null,null,"% trafień za 1 pkt",null,null,{"$f":"(COUNTIF(G9:G74,1)/COUNTA(G9:G74))*100","v":0},{"$f":"(COUNTIF(H9:H74,1)/COUNTA(H9:H74))*100","v":50},50,100,50,100,50,50,100,100,100,100,100,50,0,0,50,50,0,0,50,0,50,50,100,100,0,0,50,50,50,50,50,0,50,0,50,50,0,0]
[null,null,null,"% trafień za 0 pkt",null,null,{"$f":"(COUNTIF(G9:G74,0)/COUNTA(G9:G74))*100","v":0},{"$f":"(COUNTIF(H9:H74,0)/COUNTA(H9:H74))*100","v":0},0,0,0,0,0,50,0,0,0,0,0,50,0,0,0,0,0,0,0,50,0,0,0,0,0,0,0,50,0,0,0,50,0,0,0,0,0,0]
[]
[null,null,null,null,null,"Cel nr",1,2,3,4,5,6,7,8,9,10,11,12,13,14,15,16,17,18,19,20,21,22,23,24,25,26,27,28,29,30,31,32,33,34,35,36,37,38,39,40,"D"]
["Data:",null,43611,null,null,"dystans [m]",23,20,22.5,37,18,30,42,38,9,32,37,42,38,32,24,30,3,42,19,21,31,30,25,21,40,33,22,37,30,32,33,24,19,41,34,22.5,27,19,31,16]
["Kategoria:",null,"JUNIOR",null,null,"KZ [mm]",15,20,20,25,15,25,35,40,20,30,25,40,35,30,35,40,25,35,15,20,35,40,20,15,40,25,15,30,40,35,30,20,15,35,25,15,20,15,35,35]
["Miejsce","Imię, nazwisko","Nick","Suma punktów","% do zwycięzcy","postawa/ uwagi",null,null,"L","L",null,null,null,null,null,null,null,null,null,null,"kl","kl",null,null,"st","st",null,null,"L","L",null,null,"st","st",null,null,null,null,null,null,null,null,null,null,"kl","kl"]
[1,"Korczyński Antoni",{"$f":"IF(NOT(B9=\"\"),IF(VLOOKUP(B9,Tabela1[[Nick]:[Imię + Nazwisko]],2,FALSE)<>0,VLOOKUP(B9,Tabela1[[Nick]:[Imię + Nazwisko]],2,FALSE),\"\"),\"\")","v":"Antek"},{"$f":"SUM(G9:AT9)","v":46},{"$f":"IF(A9=1,100,IF($D$9<>0,D9/$D$9*100,\"\"))","v":100},{"$f":"IF(B9<>\"\",IF(VLOOKUP(B9,Tabela1[[#All],[Imię + Nazwisko]:[K]],11,FALSE)=1,\"K\",\"\")&IF(VLOOKUP(B9,Tabela1[[#All],[Imię + Nazwisko]:[K]],10,FALSE)=1,\"W\",\"\"),\"\")","v":""},2,2,2,1,2,1,2,1,1,1,1,1,1,1,"x","x",2,1,"x","x",2,2,2,2,1,1,"x","x",2,1,1,2,2,0,1,2,1,2,"x","x"]
[2,"Lamcha Kostek",{"$f":"IF(NOT(B10=\"\"),IF(VLOOKUP(B10,Tabela1[[Nick]:[Imię + Nazwisko]],2,FALSE)<>0,VLOOKUP(B10,Tabela1[[Nick]:[Imię + Nazwisko]],2,FALSE),\"\"),\"\")","v":"Kostek"},35,76.08695652173914,{"$f":"IF(B10<>\"\",IF(VLOOKUP(B10,Tabela1[[#All],[Imię + Nazwisko]:[K]],11,FALSE)=1,\"K\",\"\")&IF(VLOOKUP(B10,Tabela1[[#All],[Imię + Nazwisko]:[K]],10,FALSE)=1,\"W\",\"\"),\"\")","v":""},2,1,1,1,1,1,1,0,1,1,1,1,1,0,"x","x",1,2,"x","x",1,0,1,1,1,1,"x","x",1,0,2,1,1,2,2,2,2,1,"x","x"]

{"sheet":"DRUŻYNY","index":5,"n_rows":44,"n_cols":8,"rows_kept":44,"cut":false,"hidden":false,"merged":[]}
[]
["Drużyna","Nazwisko, Imię","Konkurencja","punkty (po przeliczeniu)","%"]
["WSST STRZELEC","Kostowski Jacek",{"$f":"IF(NOT(B3=\"\"),IF(VLOOKUP(B3,DaneZawodnikow!$C$2:$N$81,12,FALSE)<>0,VLOOKUP(B3,DaneZawodnikow!$C$2:$N$81,12,FALSE),\"\"),\"\")","v":"HFT 1"},{"$f":"IF(C3=\"HFT 1\",VLOOKUP(B3,'HFT1'!$B$9:$E$41,3,FALSE),IF(C3=\"HFT 2\",VLOOKUP(B3,'HFT2'!$B$9:$E$16,3,FALSE),IF(C3=\"FT\",VLOOKUP(B3,FT!$B$6:$E$21,3,FALSE),\"\")))","v":77},{"$f":"D3/$H$7","v":1}]
["WSST STRZELEC","Narbut Jarosław",{"$f":"IF(NOT(B4=\"\"),IF(VLOOKUP(B4,DaneZawodnikow!$C$2:$N$81,12,FALSE)<>0,VLOOKUP(B4,DaneZawodnikow!$C$2:$N$81,12,FALSE),\"\"),\"\")","v":"HFT 1"},{"$f":"IF(C4=\"HFT 1\",VLOOKUP(B4,'HFT1'!$B$9:$E$41,3,FALSE),IF(C4=\"HFT 2\",VLOOKUP(B4,'HFT2'!$B$9:$E$16,3,FALSE),IF(C4=\"FT\",VLOOKUP(B4,FT!$B$6:$E$21,3,FALSE),\"\")))","v":76},{"$f":"D4/$H$7","v":0.98701298701298701}]
["WSST STRZELEC","Szłapka Maciej",{"$f":"IF(NOT(B5=\"\"),IF(VLOOKUP(B5,DaneZawodnikow!$C$2:$N$81,12,FALSE)<>0,VLOOKUP(B5,DaneZawodnikow!$C$2:$N$81,12,FALSE),\"\"),\"\")","v":"HFT 1"},{"$f":"IF(C5=\"HFT 1\",VLOOKUP(B5,'HFT1'!$B$9:$E$41,3,FALSE),IF(C5=\"HFT 2\",VLOOKUP(B5,'HFT2'!$B$9:$E$16,3,FALSE),IF(C5=\"FT\",VLOOKUP(B5,FT!$B$6:$E$21,3,FALSE),\"\")))","v":71},0.92207792207792205,null,"przekalkulowane wyniki"]
["WSST STRZELEC","Krempczyński Marek",{"$f":"IF(NOT(B6=\"\"),IF(VLOOKUP(B6,DaneZawodnikow!$C$2:$N$81,12,FALSE)<>0,VLOOKUP(B6,DaneZawodnikow!$C$2:$N$81,12,FALSE),\"\"),\"\")","v":"HFT 1"},{"$f":"IF(C6=\"HFT 1\",VLOOKUP(B6,'HFT1'!$B$9:$E$41,3,FALSE),IF(C6=\"HFT 2\",VLOOKUP(B6,'HFT2'!$B$9:$E$16,3,FALSE),IF(C6=\"FT\",VLOOKUP(B6,FT!$B$6:$E$21,3,FALSE),\"\")))","v":68},0.88311688311688308,null,"FT max",76]
["WSST STRZELEC","Gacek Tomasz",{"$f":"IF(NOT(B7=\"\"),IF(VLOOKUP(B7,DaneZawodnikow!$C$2:$N$81,12,FALSE)<>0,VLOOKUP(B7,DaneZawodnikow!$C$2:$N$81,12,FALSE),\"\"),\"\")","v":"HFT 1"},{"$f":"IF(C7=\"HFT 1\",VLOOKUP(B7,'HFT1'!$B$9:$E$41,3,FALSE),IF(C7=\"HFT 2\",VLOOKUP(B7,'HFT2'!$B$9:$E$16,3,FALSE),IF(C7=\"FT\",VLOOKUP(B7,FT!$B$6:$E$21,3,FALSE),\"\")))","v":64},0.83116883116883122,null,"HFT1 max",77]
["WSST STRZELEC WYNIK",null,{"$f":"IF(NOT(B8=\"\"),IF(VLOOKUP(B8,DaneZawodnikow!$C$2:$N$81,12,FALSE)<>0,VLOOKUP(B8,DaneZawodnikow!$C$2:$N$81,12,FALSE),\"\"),\"\")","v":""},null,{"$f":"SUM(LARGE(E3:E7,{1;2;3}))","v":2.9090909090909092},null,"HFT2 max",67]
["WIKINGI","Cielepak Tomasz",{"$f":"IF(NOT(B9=\"\"),IF(VLOOKUP(B9,DaneZawodnikow!$C$2:$N$81,12,FALSE)<>0,VLOOKUP(B9,DaneZawodnikow!$C$2:$N$81,12,FALSE),\"\"),\"\")","v":"HFT 1"},{"$f":"IF(C9=\"HFT 1\",VLOOKUP(B9,'HFT1'!$B$9:$E$41,3,FALSE),IF(C9=\"HFT 2\",VLOOKUP(B9,'HFT2'!$B$9:$E$16,3,FALSE),IF(C9=\"FT\",VLOOKUP(B9,FT!$B$6:$E$21,3,FALSE),\"\")))","v":75},0.97402597402597402]
["WIKINGI","Lisowski Grzegorz",{"$f":"IF(NOT(B10=\"\"),IF(VLOOKUP(B10,DaneZawodnikow!$C$2:$N$81,12,FALSE)<>0,VLOOKUP(B10,DaneZawodnikow!$C$2:$N$81,12,FALSE),\"\"),\"\")","v":"HFT 1"},{"$f":"IF(C10=\"HFT 1\",VLOOKUP(B10,'HFT1'!$B$9:$E$41,3,FALSE),IF(C10=\"HFT 2\",VLOOKUP(B10,'HFT2'!$B$9:$E$16,3,FALSE),IF(C10=\"FT\",VLOOKUP(B10,FT!$B$6:$E$21,3,FALSE),\"\")))","v":75},0.97402597402597402]
["WIKINGI","Szałkowski Krzysztof",{"$f":"IF(NOT(B11=\"\"),IF(VLOOKUP(B11,DaneZawodnikow!$C$2:$N$81,12,FALSE)<>0,VLOOKUP(B11,DaneZawodnikow!$C$2:$N$81,12,FALSE),\"\"),\"\")","v":"HFT 1"},{"$f":"IF(C11=\"HFT 1\",VLOOKUP(B11,'HFT1'!$B$9:$E$41,3,FALSE),IF(C11=\"HFT 2\",VLOOKUP(B11,'HFT2'!$B$9:$E$16,3,FALSE),IF(C11=\"FT\",VLOOKUP(B11,FT!$B$6:$E$21,3,FALSE),\"\")))","v":72},0.93506493506493504]
["WIKINGI","Kaczmarek Mariusz",{"$f":"IF(NOT(B12=\"\"),IF(VLOOKUP(B12,DaneZawodnikow!$C$2:$N$81,12,FALSE)<>0,VLOOKUP(B12,DaneZawodnikow!$C$2:$N$81,12,FALSE),\"\"),\"\")","v":"HFT 1"},{"$f":"IF(C12=\"HFT 1\",VLOOKUP(B12,'HFT1'!$B$9:$E$41,3,FALSE),IF(C12=\"HFT 2\",VLOOKUP(B12,'HFT2'!$B$9:$E$16,3,FALSE),IF(C12=\"FT\",VLOOKUP(B12,FT!$B$6:$E$21,3,FALSE),\"\")))","v":69},0.89610389610389607]
["WIKINGI","Maciejewicz Mirosław",{"$f":"IF(NOT(B13=\"\"),IF(VLOOKUP(B13,DaneZawodnikow!$C$2:$N$81,12,FALSE)<>0,VLOOKUP(B13,DaneZawodnikow!$C$2:$N$81,12,FALSE),\"\"),\"\")","v":"HFT 1"},{"$f":"IF(C13=\"HFT 1\",VLOOKUP(B13,'HFT1'!$B$9:$E$41,3,FALSE),IF(C13=\"HFT 2\",VLOOKUP(B13,'HFT2'!$B$9:$E$16,3,FALSE),IF(C13=\"FT\",VLOOKUP(B13,FT!$B$6:$E$21,3,FALSE),\"\")))","v":67},0.87012987012987009]
["WIKINGI WYNIK",null,{"$f":"IF(NOT(B14=\"\"),IF(VLOOKUP(B14,DaneZawodnikow!$C$2:$N$81,12,FALSE)<>0,VLOOKUP(B14,DaneZawodnikow!$C$2:$N$81,12,FALSE),\"\"),\"\")","v":""},null,{"$f":"SUM(LARGE(E9:E13,{1;2;3}))","v":2.883116883116883}]
["WKFT","Rozum Radosław",{"$f":"IF(NOT(B15=\"\"),IF(VLOOKUP(B15,DaneZawodnikow!$C$2:$N$81,12,FALSE)<>0,VLOOKUP(B15,DaneZawodnikow!$C$2:$N$81,12,FALSE),\"\"),\"\")","v":"FT"},74,{"$f":"D15/$H$6","v":0.97368421052631582}]
["WKFT","Budny Artur",{"$f":"IF(NOT(B16=\"\"),IF(VLOOKUP(B16,DaneZawodnikow!$C$2:$N$81,12,FALSE)<>0,VLOOKUP(B16,DaneZawodnikow!$C$2:$N$81,12,FALSE),\"\"),\"\")","v":"HFT 2"},{"$f":"IF(C16=\"HFT 1\",VLOOKUP(B16,'HFT1'!$B$9:$E$41,3,FALSE),IF(C16=\"HFT 2\",VLOOKUP(B16,'HFT2'!$B$9:$E$16,3,FALSE),IF(C16=\"FT\",VLOOKUP(B16,FT!$B$6:$E$21,3,FALSE),\"\")))","v":63},{"$f":"D16/$H$8","v":0.94029850746268662}]
["WKFT","Remiszewski Piotr",{"$f":"IF(NOT(B17=\"\"),IF(VLOOKUP(B17,DaneZawodnikow!$C$2:$N$81,12,FALSE)<>0,VLOOKUP(B17,DaneZawodnikow!$C$2:$N$81,12,FALSE),\"\"),\"\")","v":"HFT 1"},{"$f":"IF(C17=\"HFT 1\",VLOOKUP(B17,'HFT1'!$B$9:$E$41,3,FALSE),IF(C17=\"HFT 2\",VLOOKUP(B17,'HFT2'!$B$9:$E$16,3,FALSE),IF(C17=\"FT\",VLOOKUP(B17,FT!$B$6:$E$21,3,FALSE),\"\")))","v":71},{"$f":"D17/$H$7","v":0.92207792207792205}]
["WKFT","Pachnik Rafał",{"$f":"IF(NOT(B18=\"\"),IF(VLOOKUP(B18,DaneZawodnikow!$C$2:$N$81,12,FALSE)<>0,VLOOKUP(B18,DaneZawodnikow!$C$2:$N$81,12,FALSE),\"\"),\"\")","v":"FT"},72,{"$f":"D18/$H$6","v":0.94736842105263153}]
["WKFT","Drabik Marcin",{"$f":"IF(NOT(B19=\"\"),IF(VLOOKUP(B19,DaneZawodnikow!$C$2:$N$81,12,FALSE)<>0,VLOOKUP(B19,DaneZawodnikow!$C$2:$N$81,12,FALSE),\"\"),\"\")","v":"FT"},70,{"$f":"D19/$H$6","v":0.92105263157894735}]
["WKFT WYNIK",null,{"$f":"IF(NOT(B20=\"\"),IF(VLOOKUP(B20,DaneZawodnikow!$C$2:$N$81,12,FALSE)<>0,VLOOKUP(B20,DaneZawodnikow!$C$2:$N$81,12,FALSE),\"\"),\"\")","v":""},null,{"$f":"SUM(LARGE(E15:E19,{1;2;3}))","v":2.8613511390416342}]
["SG3M","Nachman Norbert",{"$f":"IF(NOT(B21=\"\"),IF(VLOOKUP(B21,DaneZawodnikow!$C$2:$N$81,12,FALSE)<>0,VLOOKUP(B21,DaneZawodnikow!$C$2:$N$81,12,FALSE),\"\"),\"\")","v":"HFT 1"},{"$f":"IF(C21=\"HFT 1\",VLOOKUP(B21,'HFT1'!$B$9:$E$41,3,FALSE),IF(C21=\"HFT 2\",VLOOKUP(B21,'HFT2'!$B$9:$E$16,3,FALSE),IF(C21=\"FT\",VLOOKUP(B21,FT!$B$6:$E$21,3,FALSE),\"\")))","v":76},{"$f":"D21/$H$7","v":0.98701298701298701}]
["SG3M","Chojnicki Janusz",{"$f":"IF(NOT(B22=\"\"),IF(VLOOKUP(B22,DaneZawodnikow!$C$2:$N$81,12,FALSE)<>0,VLOOKUP(B22,DaneZawodnikow!$C$2:$N$81,12,FALSE),\"\"),\"\")","v":"HFT 2"},{"$f":"IF(C22=\"HFT 1\",VLOOKUP(B22,'HFT1'!$B$9:$E$41,3,FALSE),IF(C22=\"HFT 2\",VLOOKUP(B22,'HFT2'!$B$9:$E$16,3,FALSE),IF(C22=\"FT\",VLOOKUP(B22,FT!$B$6:$E$21,3,FALSE),\"\")))","v":61},{"$f":"D22/$H$8","v":0.91044776119402981}]
["SG3M","Zacharzewski Arkadiusz",{"$f":"IF(NOT(B23=\"\"),IF(VLOOKUP(B23,DaneZawodnikow!$C$2:$N$81,12,FALSE)<>0,VLOOKUP(B23,DaneZawodnikow!$C$2:$N$81,12,FALSE),\"\"),\"\")","v":"HFT 1"},{"$f":"IF(C23=\"HFT 1\",VLOOKUP(B23,'HFT1'!$B$9:$E$41,3,FALSE),IF(C23=\"HFT 2\",VLOOKUP(B23,'HFT2'!$B$9:$E$16,3,FALSE),IF(C23=\"FT\",VLOOKUP(B23,FT!$B$6:$E$21,3,FALSE),\"\")))","v":68},{"$f":"D23/$H$7","v":0.88311688311688308}]
["SG3M","Tałaj Szymon",{"$f":"IF(NOT(B24=\"\"),IF(VLOOKUP(B24,DaneZawodnikow!$C$2:$N$81,12,FALSE)<>0,VLOOKUP(B24,DaneZawodnikow!$C$2:$N$81,12,FALSE),\"\"),\"\")","v":"FT"},69,{"$f":"D24/$H$6","v":0.90789473684210531}]
["SG3M WYNIK",null,{"$f":"IF(NOT(B25=\"\"),IF(VLOOKUP(B25,DaneZawodnikow!$C$2:$N$81,12,FALSE)<>0,VLOOKUP(B25,DaneZawodnikow!$C$2:$N$81,12,FALSE),\"\"),\"\")","v":""},null,{"$f":"SUM(LARGE(E21:E24,{1;2;3}))","v":2.8053554850491222}]
["DGST BEAVER","Opiela Sławomir",{"$f":"IF(NOT(B26=\"\"),IF(VLOOKUP(B26,DaneZawodnikow!$C$2:$N$81,12,FALSE)<>0,VLOOKUP(B26,DaneZawodnikow!$C$2:$N$81,12,FALSE),\"\"),\"\")","v":"HFT 2"},{"$f":"IF(C26=\"HFT 1\",VLOOKUP(B26,'HFT1'!$B$9:$E$41,3,FALSE),IF(C26=\"HFT 2\",VLOOKUP(B26,'HFT2'!$B$9:$E$16,3,FALSE),IF(C26=\"FT\",VLOOKUP(B26,FT!$B$6:$E$21,3,FALSE),\"\")))","v":67},{"$f":"D26/$H$8","v":1}]
["DGST BEAVER","Markisz Marcin",{"$f":"IF(NOT(B27=\"\"),IF(VLOOKUP(B27,DaneZawodnikow!$C$2:$N$81,12,FALSE)<>0,VLOOKUP(B27,DaneZawodnikow!$C$2:$N$81,12,FALSE),\"\"),\"\")","v":"FT"},70,{"$f":"D27/$H$6","v":0.92105263157894735}]
["DGST BEAVER","Wietrzykowski Paweł",{"$f":"IF(NOT(B28=\"\"),IF(VLOOKUP(B28,DaneZawodnikow!$C$2:$N$81,12,FALSE)<>0,VLOOKUP(B28,DaneZawodnikow!$C$2:$N$81,12,FALSE),\"\"),\"\")","v":"HFT 1"},{"$f":"IF(C28=\"HFT 1\",VLOOKUP(B28,'HFT1'!$B$9:$E$41,3,FALSE),IF(C28=\"HFT 2\",VLOOKUP(B28,'HFT2'!$B$9:$E$16,3,FALSE),IF(C28=\"FT\",VLOOKUP(B28,FT!$B$6:$E$21,3,FALSE),\"\")))","v":66},{"$f":"D28/$H$7","v":0.8571428571428571}]
["DGST BEAVER","Brandys Piotr",{"$f":"IF(NOT(B29=\"\"),IF(VLOOKUP(B29,DaneZawodnikow!$C$2:$N$81,12,FALSE)<>0,VLOOKUP(B29,DaneZawodnikow!$C$2:$N$81,12,FALSE),\"\"),\"\")","v":"HFT 1"},{"$f":"IF(C29=\"HFT 1\",VLOOKUP(B29,'HFT1'!$B$9:$E$41,3,FALSE),IF(C29=\"HFT 2\",VLOOKUP(B29,'HFT2'!$B$9:$E$16,3,FALSE),IF(C29=\"FT\",VLOOKUP(B29,FT!$B$6:$E$21,3,FALSE),\"\")))","v":64},0.83116883116883122]
["DGST BEAVER","Merski Tomasz",{"$f":"IF(NOT(B30=\"\"),IF(VLOOKUP(B30,DaneZawodnikow!$C$2:$N$81,12,FALSE)<>0,VLOOKUP(B30,DaneZawodnikow!$C$2:$N$81,12,FALSE),\"\"),\"\")","v":"FT"},64,{"$f":"D30/$H$6","v":0.84210526315789469}]
["DGST BEAVER WYNIK",null,{"$f":"IF(NOT(B31=\"\"),IF(VLOOKUP(B31,DaneZawodnikow!$C$2:$N$81,12,FALSE)<>0,VLOOKUP(B31,DaneZawodnikow!$C$2:$N$81,12,FALSE),\"\"),\"\")","v":""},null,{"$f":"SUM(LARGE(E26:E30,{1;2;3}))","v":2.7781954887218046}]
[null,{"$f":"IF(NOT(A32=\"\"),IF(VLOOKUP(A32,DaneZawodnikow!$C$2:$N$81,12,FALSE)<>0,VLOOKUP(A32,DaneZawodnikow!$C$2:$N$81,12,FALSE),\"\"),\"\")","v":""},{"$f":"IF(B32=\"HFT 1\",VLOOKUP(A32,'HFT1'!$B$9:$E$41,4,FALSE),IF(B32=\"HFT 2\",VLOOKUP(A32,'HFT2'!$B$9:$E$16,4,FALSE),IF(B32=\"FT\",VLOOKUP(A32,FT!$B$6:$E$21,4,FALSE),\"\")))","v":""}]
[null,{"$f":"IF(NOT(A33=\"\"),IF(VLOOKUP(A33,DaneZawodnikow!$C$2:$N$81,12,FALSE)<>0,VLOOKUP(A33,DaneZawodnikow!$C$2:$N$81,12,FALSE),\"\"),\"\")","v":""},{"$f":"IF(B33=\"HFT 1\",VLOOKUP(A33,'HFT1'!$B$9:$E$41,4,FALSE),IF(B33=\"HFT 2\",VLOOKUP(A33,'HFT2'!$B$9:$E$16,4,FALSE),IF(B33=\"FT\",VLOOKUP(A33,FT!$B$6:$E$21,4,FALSE),\"\")))","v":""}]
[null,{"$f":"IF(NOT(A34=\"\"),IF(VLOOKUP(A34,DaneZawodnikow!$C$2:$N$81,12,FALSE)<>0,VLOOKUP(A34,DaneZawodnikow!$C$2:$N$81,12,FALSE),\"\"),\"\")","v":""},{"$f":"IF(B34=\"HFT 1\",VLOOKUP(A34,'HFT1'!$B$9:$E$41,4,FALSE),IF(B34=\"HFT 2\",VLOOKUP(A34,'HFT2'!$B$9:$E$16,4,FALSE),IF(B34=\"FT\",VLOOKUP(A34,FT!$B$6:$E$21,4,FALSE),\"\")))","v":""}]
[null,{"$f":"IF(NOT(A35=\"\"),IF(VLOOKUP(A35,DaneZawodnikow!$C$2:$N$81,12,FALSE)<>0,VLOOKUP(A35,DaneZawodnikow!$C$2:$N$81,12,FALSE),\"\"),\"\")","v":""},{"$f":"IF(B35=\"HFT 1\",VLOOKUP(A35,'HFT1'!$B$9:$E$41,4,FALSE),IF(B35=\"HFT 2\",VLOOKUP(A35,'HFT2'!$B$9:$E$16,4,FALSE),IF(B35=\"FT\",VLOOKUP(A35,FT!$B$6:$E$21,4,FALSE),\"\")))","v":""}]
[null,{"$f":"IF(NOT(A36=\"\"),IF(VLOOKUP(A36,DaneZawodnikow!$C$2:$N$81,12,FALSE)<>0,VLOOKUP(A36,DaneZawodnikow!$C$2:$N$81,12,FALSE),\"\"),\"\")","v":""},{"$f":"IF(B36=\"HFT 1\",VLOOKUP(A36,'HFT1'!$B$9:$E$41,4,FALSE),IF(B36=\"HFT 2\",VLOOKUP(A36,'HFT2'!$B$9:$E$16,4,FALSE),IF(B36=\"FT\",VLOOKUP(A36,FT!$B$6:$E$21,4,FALSE),\"\")))","v":""}]
[null,{"$f":"IF(NOT(A37=\"\"),IF(VLOOKUP(A37,DaneZawodnikow!$C$2:$N$81,12,FALSE)<>0,VLOOKUP(A37,DaneZawodnikow!$C$2:$N$81,12,FALSE),\"\"),\"\")","v":""},{"$f":"IF(B37=\"HFT 1\",VLOOKUP(A37,'HFT1'!$B$9:$E$41,4,FALSE),IF(B37=\"HFT 2\",VLOOKUP(A37,'HFT2'!$B$9:$E$16,4,FALSE),IF(B37=\"FT\",VLOOKUP(A37,FT!$B$6:$E$21,4,FALSE),\"\")))","v":""}]
[null,{"$f":"IF(NOT(A38=\"\"),IF(VLOOKUP(A38,DaneZawodnikow!$C$2:$N$81,12,FALSE)<>0,VLOOKUP(A38,DaneZawodnikow!$C$2:$N$81,12,FALSE),\"\"),\"\")","v":""},{"$f":"IF(B38=\"HFT 1\",VLOOKUP(A38,'HFT1'!$B$9:$E$41,4,FALSE),IF(B38=\"HFT 2\",VLOOKUP(A38,'HFT2'!$B$9:$E$16,4,FALSE),IF(B38=\"FT\",VLOOKUP(A38,FT!$B$6:$E$21,4,FALSE),\"\")))","v":""}]
[null,{"$f":"IF(NOT(A39=\"\"),IF(VLOOKUP(A39,DaneZawodnikow!$C$2:$N$81,12,FALSE)<>0,VLOOKUP(A39,DaneZawodnikow!$C$2:$N$81,12,FALSE),\"\"),\"\")","v":""},{"$f":"IF(B39=\"HFT 1\",VLOOKUP(A39,'HFT1'!$B$9:$E$41,4,FALSE),IF(B39=\"HFT 2\",VLOOKUP(A39,'HFT2'!$B$9:$E$16,4,FALSE),IF(B39=\"FT\",VLOOKUP(A39,FT!$B$6:$E$21,4,FALSE),\"\")))","v":""}]
[null,{"$f":"IF(NOT(A40=\"\"),IF(VLOOKUP(A40,DaneZawodnikow!$C$2:$N$81,12,FALSE)<>0,VLOOKUP(A40,DaneZawodnikow!$C$2:$N$81,12,FALSE),\"\"),\"\")","v":""},{"$f":"IF(B40=\"HFT 1\",VLOOKUP(A40,'HFT1'!$B$9:$E$41,4,FALSE),IF(B40=\"HFT 2\",VLOOKUP(A40,'HFT2'!$B$9:$E$16,4,FALSE),IF(B40=\"FT\",VLOOKUP(A40,FT!$B$6:$E$21,4,FALSE),\"\")))","v":""}]
[null,{"$f":"IF(NOT(A41=\"\"),IF(VLOOKUP(A41,DaneZawodnikow!$C$2:$N$81,12,FALSE)<>0,VLOOKUP(A41,DaneZawodnikow!$C$2:$N$81,12,FALSE),\"\"),\"\")","v":""},{"$f":"IF(B41=\"HFT 1\",VLOOKUP(A41,'HFT1'!$B$9:$E$41,4,FALSE),IF(B41=\"HFT 2\",VLOOKUP(A41,'HFT2'!$B$9:$E$16,4,FALSE),IF(B41=\"FT\",VLOOKUP(A41,FT!$B$6:$E$21,4,FALSE),\"\")))","v":""}]
[null,{"$f":"IF(NOT(A42=\"\"),IF(VLOOKUP(A42,DaneZawodnikow!$C$2:$N$81,12,FALSE)<>0,VLOOKUP(A42,DaneZawodnikow!$C$2:$N$81,12,FALSE),\"\"),\"\")","v":""},{"$f":"IF(B42=\"HFT 1\",VLOOKUP(A42,'HFT1'!$B$9:$E$41,4,FALSE),IF(B42=\"HFT 2\",VLOOKUP(A42,'HFT2'!$B$9:$E$16,4,FALSE),IF(B42=\"FT\",VLOOKUP(A42,FT!$B$6:$E$21,4,FALSE),\"\")))","v":""}]
[null,{"$f":"IF(NOT(A43=\"\"),IF(VLOOKUP(A43,DaneZawodnikow!$C$2:$N$81,12,FALSE)<>0,VLOOKUP(A43,DaneZawodnikow!$C$2:$N$81,12,FALSE),\"\"),\"\")","v":""},{"$f":"IF(B43=\"HFT 1\",VLOOKUP(A43,'HFT1'!$B$9:$E$41,4,FALSE),IF(B43=\"HFT 2\",VLOOKUP(A43,'HFT2'!$B$9:$E$16,4,FALSE),IF(B43=\"FT\",VLOOKUP(A43,FT!$B$6:$E$21,4,FALSE),\"\")))","v":""}]
[null,{"$f":"IF(NOT(A44=\"\"),IF(VLOOKUP(A44,DaneZawodnikow!$C$2:$N$81,12,FALSE)<>0,VLOOKUP(A44,DaneZawodnikow!$C$2:$N$81,12,FALSE),\"\"),\"\")","v":""},{"$f":"IF(B44=\"HFT 1\",VLOOKUP(A44,'HFT1'!$B$9:$E$41,4,FALSE),IF(B44=\"HFT 2\",VLOOKUP(A44,'HFT2'!$B$9:$E$16,4,FALSE),IF(B44=\"FT\",VLOOKUP(A44,FT!$B$6:$E$21,4,FALSE),\"\")))","v":""}]

{"sheet":"Sylwetki Karabin","index":6,"n_rows":28,"n_cols":47,"rows_kept":28,"cut":false,"hidden":false,"merged":[[3,6,3,25],[3,26,3,45],[0,3,0,5],[1,0,1,1],[1,3,1,5],[2,3,2,5],[3,0,3,1],[3,2,3,4],[4,0,4,1],[4,2,4,4],[5,0,5,1],[5,2,5,4],[6,0,6,1],[6,2,6,4],[5,26,6,30],[5,31,6,35],[5,36,6,40],[5,41,6,45],[5,5,6,5],[5,6,6,10],[5,11,6,15],[5,16,6,20],[5,21,6,25]]}
["Celów:",40]
[null,null,null,"% trafień",null,null,{"$f":"(COUNTIF(G9:G74,1)/COUNTA(G9:G74))*100","v":45},{"$f":"(COUNTIF(H9:H74,1)/COUNTA(H9:H74))*100","v":40},45,40,55.000000000000007,35,60,50,60,45,25,30,40,55.000000000000007,40,30,45,45,55.000000000000007,50,55.000000000000007,50,60,50,65,80,50,40,75,65,35,35,20,40,40,50,50,45,50,60]
[null,null,null,"% pudło",null,null,{"$f":"(COUNTIF(G9:G74,0)/COUNTA(G9:G74))*100","v":55.000000000000007},{"$f":"(COUNTIF(H9:H74,0)/COUNTA(H9:H74))*100","v":60},55.000000000000007,60,45,65,40,50,40,55.000000000000007,75,70,60,45,60,70,55.000000000000007,55.000000000000007,45,50,45,50,40,50,35,20,50,60,25,35,65,65,80,60,60,50,50,55.000000000000007,50,40]
[null,null,null,null,null,null,"Przejście pierwsze",null,null,null,null,null,null,null,null,null,null,null,null,null,null,null,null,null,null,null,"Przejście drugie"]
[null,null,null,null,null,"nr",1,2,3,4,5,6,7,8,9,10,11,12,13,14,15,16,17,18,19,20,1,2,3,4,5,6,7,8,9,10,11,12,13,14,15,16,17,18,19,20,"D"]
["Data:",null,43611,null,null,"sylwetka","kurczak",null,null,null,null,"dzik",null,null,null,null,"indyk",null,null,null,null,"muflon",null,null,null,null,"kurczak",null,null,null,null,"dzik",null,null,null,null,"indyk",null,null,null,null,"muflon"]
["Kategoria:",null,"Sylwetki Karabin"]
["Miejsce","Imię, nazwisko","Nick","Suma punktów","% do zwycięzcy","postawa/ uwagi"]
[1,"Wietrzykowski Krzysztof",{"$f":"IF(NOT(B9=\"\"),IF(VLOOKUP(B9,Tabela1[[Nick]:[Imię + Nazwisko]],2,FALSE)<>0,VLOOKUP(B9,Tabela1[[Nick]:[Imię + Nazwisko]],2,FALSE),\"\"),\"\")","v":"Krzysztof W."},{"$f":"SUM(G9:AT9)","v":28},{"$f":"IF(A9=1,100,IF($D$9<>0,D9/$D$9*100,\"\"))","v":100},{"$f":"IF(B9<>\"\",IF(VLOOKUP(B9,Tabela1[[#All],[Imię + Nazwisko]:[K]],11,FALSE)=1,\"K\",\"\")&IF(VLOOKUP(B9,Tabela1[[#All],[Imię + Nazwisko]:[K]],10,FALSE)=1,\"W\",\"\"),\"\")","v":""},1,1,1,0,1,0,1,1,1,1,1,0,1,0,1,1,1,1,0,0,1,1,1,1,1,1,1,1,1,0,0,1,1,1,0,1,0,0,0,1]
[2,"Cielepak Tomasz",{"$f":"IF(NOT(B10=\"\"),IF(VLOOKUP(B10,Tabela1[[Nick]:[Imię + Nazwisko]],2,FALSE)<>0,VLOOKUP(B10,Tabela1[[Nick]:[Imię + Nazwisko]],2,FALSE),\"\"),\"\")","v":"MASZOT"},26,92.857142857142861,{"$f":"IF(B10<>\"\",IF(VLOOKUP(B10,Tabela1[[#All],[Imię + Nazwisko]:[K]],11,FALSE)=1,\"K\",\"\")&IF(VLOOKUP(B10,Tabela1[[#All],[Imię + Nazwisko]:[K]],10,FALSE)=1,\"W\",\"\"),\"\")","v":""},0,1,1,1,1,0,1,1,1,1,0,0,0,1,0,1,1,1,1,1,1,1,1,0,1,1,0,1,0,1,1,1,0,0,1,0,1,0,0,1]
[3,"Wróbel Robert",{"$f":"IF(NOT(B11=\"\"),IF(VLOOKUP(B11,Tabela1[[Nick]:[Imię + Nazwisko]],2,FALSE)<>0,VLOOKUP(B11,Tabela1[[Nick]:[Imię + Nazwisko]],2,FALSE),\"\"),\"\")","v":"Photomaker"},25,89.285714285714292,{"$f":"IF(B11<>\"\",IF(VLOOKUP(B11,Tabela1[[#All],[Imię + Nazwisko]:[K]],11,FALSE)=1,\"K\",\"\")&IF(VLOOKUP(B11,Tabela1[[#All],[Imię + Nazwisko]:[K]],10,FALSE)=1,\"W\",\"\"),\"\")","v":""},1,1,1,0,1,0,1,1,1,0,0,0,0,0,0,1,1,0,1,1,1,1,1,1,1,0,1,0,1,1,0,1,0,0,1,1,0,1,1,1]
[4,"Szałkowski Krzysztof",{"$f":"IF(NOT(B12=\"\"),IF(VLOOKUP(B12,Tabela1[[Nick]:[Imię + Nazwisko]],2,FALSE)<>0,VLOOKUP(B12,Tabela1[[Nick]:[Imię + Nazwisko]],2,FALSE),\"\"),\"\")","v":"Kris"},23,82.142857142857139,{"$f":"IF(B12<>\"\",IF(VLOOKUP(B12,Tabela1[[#All],[Imię + Nazwisko]:[K]],11,FALSE)=1,\"K\",\"\")&IF(VLOOKUP(B12,Tabela1[[#All],[Imię + Nazwisko]:[K]],10,FALSE)=1,\"W\",\"\"),\"\")","v":""},1,1,1,1,0,1,0,0,0,0,0,1,0,1,1,1,0,1,1,1,1,0,0,1,0,1,0,1,1,1,0,1,0,1,0,1,0,1,0,1]
[5,"Król Andrzej",{"$f":"IF(NOT(B13=\"\"),IF(VLOOKUP(B13,Tabela1[[Nick]:[Imię + Nazwisko]],2,FALSE)<>0,VLOOKUP(B13,Tabela1[[Nick]:[Imię + Nazwisko]],2,FALSE),\"\"),\"\")","v":"kombatant"},23,82.142857142857139,{"$f":"IF(B13<>\"\",IF(VLOOKUP(B13,Tabela1[[#All],[Imię + Nazwisko]:[K]],11,FALSE)=1,\"K\",\"\")&IF(VLOOKUP(B13,Tabela1[[#All],[Imię + Nazwisko]:[K]],10,FALSE)=1,\"W\",\"\"),\"\")","v":"W"},0,1,1,1,1,1,1,0,1,1,0,0,0,0,0,0,0,0,0,1,0,1,1,1,1,1,0,0,1,1,1,0,0,1,0,1,1,1,1,1]
[6,"Słowik Piotr",{"$f":"IF(NOT(B14=\"\"),IF(VLOOKUP(B14,Tabela1[[Nick]:[Imię + Nazwisko]],2,FALSE)<>0,VLOOKUP(B14,Tabela1[[Nick]:[Imię + Nazwisko]],2,FALSE),\"\"),\"\")","v":"Włamywacz"},21,75,{"$f":"IF(B14<>\"\",IF(VLOOKUP(B14,Tabela1[[#All],[Imię + Nazwisko]:[K]],11,FALSE)=1,\"K\",\"\")&IF(VLOOKUP(B14,Tabela1[[#All],[Imię + Nazwisko]:[K]],10,FALSE)=1,\"W\",\"\"),\"\")","v":""},1,1,0,1,1,0,0,1,0,0,0,1,0,1,0,0,1,0,1,0,1,1,1,1,0,1,1,1,1,1,0,0,0,1,0,1,0,0,1,0]
[7,"Wolski Robert",{"$f":"IF(NOT(B15=\"\"),IF(VLOOKUP(B15,Tabela1[[Nick]:[Imię + Nazwisko]],2,FALSE)<>0,VLOOKUP(B15,Tabela1[[Nick]:[Imię + Nazwisko]],2,FALSE),\"\"),\"\")","v":"Wola"},21,75,{"$f":"IF(B15<>\"\",IF(VLOOKUP(B15,Tabela1[[#All],[Imię + Nazwisko]:[K]],11,FALSE)=1,\"K\",\"\")&IF(VLOOKUP(B15,Tabela1[[#All],[Imię + Nazwisko]:[K]],10,FALSE)=1,\"W\",\"\"),\"\")","v":""},1,0,1,0,1,1,1,1,0,0,1,0,1,1,1,0,1,0,0,0,0,1,0,0,0,1,0,0,1,1,1,0,0,1,0,0,1,1,1,1]
[8,"Rose Piotr",{"$f":"IF(NOT(B16=\"\"),IF(VLOOKUP(B16,Tabela1[[Nick]:[Imię + Nazwisko]],2,FALSE)<>0,VLOOKUP(B16,Tabela1[[Nick]:[Imię + Nazwisko]],2,FALSE),\"\"),\"\")","v":"box555"},21,75,{"$f":"IF(B16<>\"\",IF(VLOOKUP(B16,Tabela1[[#All],[Imię + Nazwisko]:[K]],11,FALSE)=1,\"K\",\"\")&IF(VLOOKUP(B16,Tabela1[[#All],[Imię + Nazwisko]:[K]],10,FALSE)=1,\"W\",\"\"),\"\")","v":""},0,0,0,0,0,0,0,0,1,1,0,0,0,1,0,0,1,1,1,1,0,0,1,1,1,1,1,0,1,0,1,1,0,0,1,1,1,1,1,1]
[9,"Wieloszyńska Aleksandra",{"$f":"IF(NOT(B17=\"\"),IF(VLOOKUP(B17,Tabela1[[Nick]:[Imię + Nazwisko]],2,FALSE)<>0,VLOOKUP(B17,Tabela1[[Nick]:[Imię + Nazwisko]],2,FALSE),\"\"),\"\")","v":"`=Ola="},20,71.428571428571431,{"$f":"IF(B17<>\"\",IF(VLOOKUP(B17,Tabela1[[#All],[Imię + Nazwisko]:[K]],11,FALSE)=1,\"K\",\"\")&IF(VLOOKUP(B17,Tabela1[[#All],[Imię + Nazwisko]:[K]],10,FALSE)=1,\"W\",\"\"),\"\")","v":"K"},0,0,0,1,0,1,1,0,1,1,0,1,0,0,1,0,1,0,1,1,0,0,0,0,1,1,1,0,1,1,0,0,0,1,0,1,1,1,1,0]
[10,"Rybarczyk Artur",{"$f":"IF(NOT(B18=\"\"),IF(VLOOKUP(B18,Tabela1[[Nick]:[Imię + Nazwisko]],2,FALSE)<>0,VLOOKUP(B18,Tabela1[[Nick]:[Imię + Nazwisko]],2,FALSE),\"\"),\"\")","v":"ArturR"},20,71.428571428571431,{"$f":"IF(B18<>\"\",IF(VLOOKUP(B18,Tabela1[[#All],[Imię + Nazwisko]:[K]],11,FALSE)=1,\"K\",\"\")&IF(VLOOKUP(B18,Tabela1[[#All],[Imię + Nazwisko]:[K]],10,FALSE)=1,\"W\",\"\"),\"\")","v":""},1,0,0,0,0,1,0,1,1,0,1,0,0,0,0,1,0,1,0,1,1,1,0,0,1,1,0,1,1,0,1,0,1,0,1,1,0,1,1,0]
[11,"Tałaj Szymon",{"$f":"IF(NOT(B19=\"\"),IF(VLOOKUP(B19,Tabela1[[Nick]:[Imię + Nazwisko]],2,FALSE)<>0,VLOOKUP(B19,Tabela1[[Nick]:[Imię + Nazwisko]],2,FALSE),\"\"),\"\")","v":"slowroots"},19,67.857142857142861,{"$f":"IF(B19<>\"\",IF(VLOOKUP(B19,Tabela1[[#All],[Imię + Nazwisko]:[K]],11,FALSE)=1,\"K\",\"\")&IF(VLOOKUP(B19,Tabela1[[#All],[Imię + Nazwisko]:[K]],10,FALSE)=1,\"W\",\"\"),\"\")","v":""},1,0,1,0,0,1,1,1,0,0,1,0,1,1,1,0,1,1,0,1,0,0,1,0,0,0,0,0,1,1,0,0,1,0,0,1,0,1,0,1]
[12,"Remiszewski Piotr",{"$f":"IF(NOT(B20=\"\"),IF(VLOOKUP(B20,Tabela1[[Nick]:[Imię + Nazwisko]],2,FALSE)<>0,VLOOKUP(B20,Tabela1[[Nick]:[Imię + Nazwisko]],2,FALSE),\"\"),\"\")","v":"red5555"},19,67.857142857142861,{"$f":"IF(B20<>\"\",IF(VLOOKUP(B20,Tabela1[[#All],[Imię + Nazwisko]:[K]],11,FALSE)=1,\"K\",\"\")&IF(VLOOKUP(B20,Tabela1[[#All],[Imię + Nazwisko]:[K]],10,FALSE)=1,\"W\",\"\"),\"\")","v":""},1,0,0,0,0,1,0,1,1,1,0,1,1,1,1,0,0,1,1,0,1,1,1,1,0,1,1,0,0,0,1,0,0,0,0,0,0,0,0,1]
[13,"Korpalski Artur",{"$f":"IF(NOT(B21=\"\"),IF(VLOOKUP(B21,Tabela1[[Nick]:[Imię + Nazwisko]],2,FALSE)<>0,VLOOKUP(B21,Tabela1[[Nick]:[Imię + Nazwisko]],2,FALSE),\"\"),\"\")","v":"Artkor"},18,64.285714285714292,{"$f":"IF(B21<>\"\",IF(VLOOKUP(B21,Tabela1[[#All],[Imię + Nazwisko]:[K]],11,FALSE)=1,\"K\",\"\")&IF(VLOOKUP(B21,Tabela1[[#All],[Imię + Nazwisko]:[K]],10,FALSE)=1,\"W\",\"\"),\"\")","v":""},0,0,0,1,1,0,1,0,1,0,0,0,1,1,0,1,0,0,0,1,1,0,1,0,1,1,0,0,1,0,0,1,0,1,1,0,1,0,1,0]
[14,"Gacek Tomasz",{"$f":"IF(NOT(B22=\"\"),IF(VLOOKUP(B22,Tabela1[[Nick]:[Imię + Nazwisko]],2,FALSE)<>0,VLOOKUP(B22,Tabela1[[Nick]:[Imię + Nazwisko]],2,FALSE),\"\"),\"\")","v":"WuDe"},17,60.714285714285708,{"$f":"IF(B22<>\"\",IF(VLOOKUP(B22,Tabela1[[#All],[Imię + Nazwisko]:[K]],11,FALSE)=1,\"K\",\"\")&IF(VLOOKUP(B22,Tabela1[[#All],[Imię + Nazwisko]:[K]],10,FALSE)=1,\"W\",\"\"),\"\")","v":""},0,0,1,1,1,0,0,0,1,1,0,0,1,0,0,0,0,1,1,0,0,0,1,0,1,1,1,0,1,0,0,0,1,0,1,0,1,0,0,1]
[15,"Krempczyński Marek",{"$f":"IF(NOT(B23=\"\"),IF(VLOOKUP(B23,Tabela1[[Nick]:[Imię + Nazwisko]],2,FALSE)<>0,VLOOKUP(B23,Tabela1[[Nick]:[Imię + Nazwisko]],2,FALSE),\"\"),\"\")","v":"Łysy"},16,57.142857142857139,{"$f":"IF(B23<>\"\",IF(VLOOKUP(B23,Tabela1[[#All],[Imię + Nazwisko]:[K]],11,FALSE)=1,\"K\",\"\")&IF(VLOOKUP(B23,Tabela1[[#All],[Imię + Nazwisko]:[K]],10,FALSE)=1,\"W\",\"\"),\"\")","v":""},1,1,1,1,1,0,1,0,1,0,1,1,0,1,0,0,0,1,1,0,1,0,0,0,1,1,0,0,0,1,0,0,0,0,0,0,0,0,0,0]
[16,"Kaczmarek Mariusz",{"$f":"IF(NOT(B24=\"\"),IF(VLOOKUP(B24,Tabela1[[Nick]:[Imię + Nazwisko]],2,FALSE)<>0,VLOOKUP(B24,Tabela1[[Nick]:[Imię + Nazwisko]],2,FALSE),\"\"),\"\")","v":"Mario_64"},15,53.571428571428569,{"$f":"IF(B24<>\"\",IF(VLOOKUP(B24,Tabela1[[#All],[Imię + Nazwisko]:[K]],11,FALSE)=1,\"K\",\"\")&IF(VLOOKUP(B24,Tabela1[[#All],[Imię + Nazwisko]:[K]],10,FALSE)=1,\"W\",\"\"),\"\")","v":""},0,0,0,0,1,0,1,0,0,0,0,0,0,1,0,0,1,0,1,0,1,0,0,1,0,1,0,1,1,0,0,0,0,0,1,1,1,0,1,1]
[17,"Sadowski Eugeniusz",{"$f":"IF(NOT(B25=\"\"),IF(VLOOKUP(B25,Tabela1[[Nick]:[Imię + Nazwisko]],2,FALSE)<>0,VLOOKUP(B25,Tabela1[[Nick]:[Imię + Nazwisko]],2,FALSE),\"\"),\"\")","v":"eugsad"},15,53.571428571428569,{"$f":"IF(B25<>\"\",IF(VLOOKUP(B25,Tabela1[[#All],[Imię + Nazwisko]:[K]],11,FALSE)=1,\"K\",\"\")&IF(VLOOKUP(B25,Tabela1[[#All],[Imię + Nazwisko]:[K]],10,FALSE)=1,\"W\",\"\"),\"\")","v":"W"},0,1,0,0,0,0,1,0,1,0,0,0,1,0,0,0,0,0,0,0,1,0,1,0,1,1,1,1,1,1,0,1,0,0,1,0,1,0,0,0]
[18,"Maciejewicz Mirosław",{"$f":"IF(NOT(B26=\"\"),IF(VLOOKUP(B26,Tabela1[[Nick]:[Imię + Nazwisko]],2,FALSE)<>0,VLOOKUP(B26,Tabela1[[Nick]:[Imię + Nazwisko]],2,FALSE),\"\"),\"\")","v":"Krauser"},13,46.428571428571431,{"$f":"IF(B26<>\"\",IF(VLOOKUP(B26,Tabela1[[#All],[Imię + Nazwisko]:[K]],11,FALSE)=1,\"K\",\"\")&IF(VLOOKUP(B26,Tabela1[[#All],[Imię + Nazwisko]:[K]],10,FALSE)=1,\"W\",\"\"),\"\")","v":""},0,0,0,0,0,0,0,0,0,1,0,0,0,1,1,0,0,0,1,1,0,1,0,1,1,0,1,1,1,1,0,0,0,0,0,0,0,0,0,1]
[19,"Lisowski Grzegorz",{"$f":"IF(NOT(B27=\"\"),IF(VLOOKUP(B27,Tabela1[[Nick]:[Imię + Nazwisko]],2,FALSE)<>0,VLOOKUP(B27,Tabela1[[Nick]:[Imię + Nazwisko]],2,FALSE),\"\"),\"\")","v":"Lisek"},12,42.857142857142854,{"$f":"IF(B27<>\"\",IF(VLOOKUP(B27,Tabela1[[#All],[Imię + Nazwisko]:[K]],11,FALSE)=1,\"K\",\"\")&IF(VLOOKUP(B27,Tabela1[[#All],[Imię + Nazwisko]:[K]],10,FALSE)=1,\"W\",\"\"),\"\")","v":""},0,0,0,0,1,0,0,1,0,0,0,1,0,0,1,0,0,0,0,0,0,0,0,1,1,1,1,0,0,1,1,0,0,1,0,0,0,0,1,0]
[20,"Śmigaj Łukasz",{"$f":"IF(NOT(B28=\"\"),IF(VLOOKUP(B28,Tabela1[[Nick]:[Imię + Nazwisko]],2,FALSE)<>0,VLOOKUP(B28,Tabela1[[Nick]:[Imię + Nazwisko]],2,FALSE),\"\"),\"\")","v":"Łukasz"},9,32.142857142857146,{"$f":"IF(B28<>\"\",IF(VLOOKUP(B28,Tabela1[[#All],[Imię + Nazwisko]:[K]],11,FALSE)=1,\"K\",\"\")&IF(VLOOKUP(B28,Tabela1[[#All],[Imię + Nazwisko]:[K]],10,FALSE)=1,\"W\",\"\"),\"\")","v":""},0,0,0,0,0,0,1,1,0,1,0,0,1,0,0,0,0,0,0,0,0,1,1,0,0,0,0,0,0,1,0,0,0,0,0,0,1,1,0,0]

{"sheet":"Sylwetki Pistolet","index":7,"n_rows":19,"n_cols":47,"rows_kept":19,"cut":false,"hidden":false,"merged":[[0,3,0,5],[1,0,1,1],[1,3,1,5],[2,3,2,5],[3,0,3,1],[3,2,3,4],[6,0,6,1],[6,2,6,4],[3,6,3,25],[3,26,3,45],[4,0,4,1],[4,2,4,4],[5,0,5,1],[5,2,5,4],[5,5,6,5],[5,6,6,10],[5,11,6,15],[5,16,6,20],[5,21,6,25],[5,26,6,30],[5,31,6,35],[5,36,6,40],[5,41,6,45]]}
["Celów:",40]
[null,null,null,"% trafień",null,null,{"$f":"(COUNTIF(G9:G74,1)/COUNTA(G9:G74))*100","v":45.454545454545453},{"$f":"(COUNTIF(H9:H74,1)/COUNTA(H9:H74))*100","v":54.54545454545454},45.454545454545453,54.54545454545454,36.363636363636367,63.636363636363633,45.454545454545453,63.636363636363633,36.363636363636367,36.363636363636367,63.636363636363633,36.363636363636367,18.181818181818183,36.363636363636367,27.27272727272727,27.27272727272727,45.454545454545453,63.636363636363633,63.636363636363633,36.363636363636367,63.636363636363633,63.636363636363633,54.54545454545454,72.727272727272734,45.454545454545453,45.454545454545453,36.363636363636367,45.454545454545453,63.636363636363633,72.727272727272734,27.27272727272727,54.54545454545454,36.363636363636367,63.636363636363633,27.27272727272727,54.54545454545454,36.363636363636367,45.454545454545453,54.54545454545454,45.454545454545453]
[null,null,null,"% pudło",null,null,{"$f":"(COUNTIF(G9:G74,0)/COUNTA(G9:G74))*100","v":54.54545454545454},{"$f":"(COUNTIF(H9:H74,0)/COUNTA(H9:H74))*100","v":45.454545454545453},54.54545454545454,45.454545454545453,63.636363636363633,36.363636363636367,54.54545454545454,36.363636363636367,63.636363636363633,63.636363636363633,36.363636363636367,63.636363636363633,81.818181818181827,63.636363636363633,72.727272727272734,72.727272727272734,54.54545454545454,36.363636363636367,36.363636363636367,63.636363636363633,36.363636363636367,36.363636363636367,45.454545454545453,27.27272727272727,54.54545454545454,54.54545454545454,63.636363636363633,54.54545454545454,36.363636363636367,27.27272727272727,72.727272727272734,45.454545454545453,63.636363636363633,36.363636363636367,72.727272727272734,45.454545454545453,63.636363636363633,54.54545454545454,45.454545454545453,54.54545454545454]
[null,null,null,null,null,null,"Przejście pierwsze",null,null,null,null,null,null,null,null,null,null,null,null,null,null,null,null,null,null,null,"Przejście drugie"]
[null,null,null,null,null,"nr",1,2,3,4,5,6,7,8,9,10,11,12,13,14,15,16,17,18,19,20,1,2,3,4,5,6,7,8,9,10,11,12,13,14,15,16,17,18,19,20,"D"]
["Data:",null,43611,null,null,"sylwetka","kurczak",null,null,null,null,"dzik",null,null,null,null,"indyk",null,null,null,null,"muflon",null,null,null,null,"kurczak",null,null,null,null,"dzik",null,null,null,null,"indyk",null,null,null,null,"muflon"]
["Kategoria:",null,"Sylwetki Pistolet"]
["Miejsce","Imię, nazwisko","Nick","Suma punktów","% do zwycięzcy","postawa/ uwagi"]
[1,"Wróbel Robert",{"$f":"IF(NOT(B9=\"\"),IF(VLOOKUP(B9,Tabela1[[Nick]:[Imię + Nazwisko]],2,FALSE)<>0,VLOOKUP(B9,Tabela1[[Nick]:[Imię + Nazwisko]],2,FALSE),\"\"),\"\")","v":"Photomaker"},{"$f":"SUM(G9:AT9)","v":26},{"$f":"IF(A9=1,100,IF($D$9<>0,D9/$D$9*100,\"\"))","v":100},{"$f":"IF(B9<>\"\",IF(VLOOKUP(B9,Tabela1[[#All],[Imię + Nazwisko]:[K]],11,FALSE)=1,\"K\",\"\")&IF(VLOOKUP(B9,Tabela1[[#All],[Imię + Nazwisko]:[K]],10,FALSE)=1,\"W\",\"\"),\"\")","v":""},1,0,0,1,1,1,1,0,1,0,1,1,1,1,0,0,0,1,1,0,1,1,1,1,1,1,1,1,1,1,0,0,0,1,0,1,0,1,1,0,1]
[2,"Rose Piotr",{"$f":"IF(NOT(B10=\"\"),IF(VLOOKUP(B10,Tabela1[[Nick]:[Imię + Nazwisko]],2,FALSE)<>0,VLOOKUP(B10,Tabela1[[Nick]:[Imię + Nazwisko]],2,FALSE),\"\"),\"\")","v":"box555"},26,100,{"$f":"IF(B10<>\"\",IF(VLOOKUP(B10,Tabela1[[#All],[Imię + Nazwisko]:[K]],11,FALSE)=1,\"K\",\"\")&IF(VLOOKUP(B10,Tabela1[[#All],[Imię + Nazwisko]:[K]],10,FALSE)=1,\"W\",\"\"),\"\")","v":""},1,0,0,1,1,1,1,1,0,1,1,0,0,1,0,0,1,1,1,1,1,1,0,1,1,0,0,1,1,1,1,1,0,0,0,1,1,1,0,1,2]
[3,"Król Andrzej",{"$f":"IF(NOT(B11=\"\"),IF(VLOOKUP(B11,Tabela1[[Nick]:[Imię + Nazwisko]],2,FALSE)<>0,VLOOKUP(B11,Tabela1[[Nick]:[Imię + Nazwisko]],2,FALSE),\"\"),\"\")","v":"kombatant"},24,92.307692307692307,{"$f":"IF(B11<>\"\",IF(VLOOKUP(B11,Tabela1[[#All],[Imię + Nazwisko]:[K]],11,FALSE)=1,\"K\",\"\")&IF(VLOOKUP(B11,Tabela1[[#All],[Imię + Nazwisko]:[K]],10,FALSE)=1,\"W\",\"\"),\"\")","v":"W"},0,1,1,0,0,1,0,1,1,1,1,0,0,0,0,1,1,1,0,1,1,1,1,1,1,1,0,1,0,1,1,0,0,1,1,1,0,0,1,0]
[4,"Majda Jarosław",{"$f":"IF(NOT(B12=\"\"),IF(VLOOKUP(B12,Tabela1[[Nick]:[Imię + Nazwisko]],2,FALSE)<>0,VLOOKUP(B12,Tabela1[[Nick]:[Imię + Nazwisko]],2,FALSE),\"\"),\"\")","v":"czaputek"},22,84.615384615384613,{"$f":"IF(B12<>\"\",IF(VLOOKUP(B12,Tabela1[[#All],[Imię + Nazwisko]:[K]],11,FALSE)=1,\"K\",\"\")&IF(VLOOKUP(B12,Tabela1[[#All],[Imię + Nazwisko]:[K]],10,FALSE)=1,\"W\",\"\"),\"\")","v":""},1,0,1,1,1,1,0,1,0,1,1,0,1,0,1,1,1,0,1,0,1,1,0,1,0,0,0,0,1,1,0,1,0,1,0,0,0,1,0,1]
[5,"Krempczyński Marek",{"$f":"IF(NOT(B13=\"\"),IF(VLOOKUP(B13,Tabela1[[Nick]:[Imię + Nazwisko]],2,FALSE)<>0,VLOOKUP(B13,Tabela1[[Nick]:[Imię + Nazwisko]],2,FALSE),\"\"),\"\")","v":"Łysy"},20,76.923076923076934,{"$f":"IF(B13<>\"\",IF(VLOOKUP(B13,Tabela1[[#All],[Imię + Nazwisko]:[K]],11,FALSE)=1,\"K\",\"\")&IF(VLOOKUP(B13,Tabela1[[#All],[Imię + Nazwisko]:[K]],10,FALSE)=1,\"W\",\"\"),\"\")","v":""},0,1,1,1,1,1,0,0,0,0,1,1,0,1,1,0,0,1,0,0,1,1,1,1,0,0,0,0,1,0,1,1,0,0,0,0,0,1,1,1]
[5,"Wieloszyńska Aleksandra",{"$f":"IF(NOT(B14=\"\"),IF(VLOOKUP(B14,Tabela1[[Nick]:[Imię + Nazwisko]],2,FALSE)<>0,VLOOKUP(B14,Tabela1[[Nick]:[Imię + Nazwisko]],2,FALSE),\"\"),\"\")","v":"`=Ola="},20,76.923076923076934,{"$f":"IF(B14<>\"\",IF(VLOOKUP(B14,Tabela1[[#All],[Imię + Nazwisko]:[K]],11,FALSE)=1,\"K\",\"\")&IF(VLOOKUP(B14,Tabela1[[#All],[Imię + Nazwisko]:[K]],10,FALSE)=1,\"W\",\"\"),\"\")","v":"K"},0,1,1,1,0,1,1,1,0,0,1,1,0,1,0,0,1,0,0,0,1,0,1,1,1,0,0,1,0,0,0,1,1,1,1,1,0,0,0,0]
[7,"Kaczmarek Mariusz",{"$f":"IF(NOT(B15=\"\"),IF(VLOOKUP(B15,Tabela1[[Nick]:[Imię + Nazwisko]],2,FALSE)<>0,VLOOKUP(B15,Tabela1[[Nick]:[Imię + Nazwisko]],2,FALSE),\"\"),\"\")","v":"Mario_64"},16,61.53846153846154,{"$f":"IF(B15<>\"\",IF(VLOOKUP(B15,Tabela1[[#All],[Imię + Nazwisko]:[K]],11,FALSE)=1,\"K\",\"\")&IF(VLOOKUP(B15,Tabela1[[#All],[Imię + Nazwisko]:[K]],10,FALSE)=1,\"W\",\"\"),\"\")","v":""},0,1,0,1,0,0,0,1,0,0,0,1,0,0,1,0,0,1,1,0,0,1,0,1,0,1,1,0,1,0,0,0,1,0,0,1,1,0,0,1]
[7,"Remiszewski Piotr",{"$f":"IF(NOT(B16=\"\"),IF(VLOOKUP(B16,Tabela1[[Nick]:[Imię + Nazwisko]],2,FALSE)<>0,VLOOKUP(B16,Tabela1[[Nick]:[Imię + Nazwisko]],2,FALSE),\"\"),\"\")","v":"red5555"},16,61.53846153846154,{"$f":"IF(B16<>\"\",IF(VLOOKUP(B16,Tabela1[[#All],[Imię + Nazwisko]:[K]],11,FALSE)=1,\"K\",\"\")&IF(VLOOKUP(B16,Tabela1[[#All],[Imię + Nazwisko]:[K]],10,FALSE)=1,\"W\",\"\"),\"\")","v":""},1,1,1,0,0,0,1,1,1,1,1,0,0,0,0,0,0,0,1,0,0,0,1,1,0,1,0,0,0,1,0,1,0,0,0,0,1,0,1,0]
[9,"Lisowski Grzegorz",{"$f":"IF(NOT(B17=\"\"),IF(VLOOKUP(B17,Tabela1[[Nick]:[Imię + Nazwisko]],2,FALSE)<>0,VLOOKUP(B17,Tabela1[[Nick]:[Imię + Nazwisko]],2,FALSE),\"\"),\"\")","v":"Lisek"},14,53.846153846153847,{"$f":"IF(B17<>\"\",IF(VLOOKUP(B17,Tabela1[[#All],[Imię + Nazwisko]:[K]],11,FALSE)=1,\"K\",\"\")&IF(VLOOKUP(B17,Tabela1[[#All],[Imię + Nazwisko]:[K]],10,FALSE)=1,\"W\",\"\"),\"\")","v":""},0,1,0,0,0,1,0,0,1,0,0,0,0,0,0,0,0,1,1,1,0,1,0,0,1,1,1,0,1,1,0,0,0,1,0,0,0,0,1,0]
[9,"Korpalski Artur",{"$f":"IF(NOT(B18=\"\"),IF(VLOOKUP(B18,Tabela1[[Nick]:[Imię + Nazwisko]],2,FALSE)<>0,VLOOKUP(B18,Tabela1[[Nick]:[Imię + Nazwisko]],2,FALSE),\"\"),\"\")","v":"Artkor"},14,53.846153846153847,{"$f":"IF(B18<>\"\",IF(VLOOKUP(B18,Tabela1[[#All],[Imię + Nazwisko]:[K]],11,FALSE)=1,\"K\",\"\")&IF(VLOOKUP(B18,Tabela1[[#All],[Imię + Nazwisko]:[K]],10,FALSE)=1,\"W\",\"\"),\"\")","v":""},1,0,0,0,0,0,1,1,0,0,0,0,0,0,0,0,0,0,1,1,0,0,0,0,0,0,1,0,1,1,0,1,1,1,0,1,0,0,1,1]
[11,"Maciejewicz Mirosław",{"$f":"IF(NOT(B19=\"\"),IF(VLOOKUP(B19,Tabela1[[Nick]:[Imię + Nazwisko]],2,FALSE)<>0,VLOOKUP(B19,Tabela1[[Nick]:[Imię + Nazwisko]],2,FALSE),\"\"),\"\")","v":"Krauser"},12,46.153846153846153,{"$f":"IF(B19<>\"\",IF(VLOOKUP(B19,Tabela1[[#All],[Imię + Nazwisko]:[K]],11,FALSE)=1,\"K\",\"\")&IF(VLOOKUP(B19,Tabela1[[#All],[Imię + Nazwisko]:[K]],10,FALSE)=1,\"W\",\"\"),\"\")","v":""},0,0,0,0,0,0,0,0,0,0,0,0,0,0,0,1,1,1,0,0,1,0,1,0,0,0,0,1,0,1,0,0,1,1,1,0,1,1,0,0]

{"sheet":"Weterani i Kobiety","index":8,"n_rows":16,"n_cols":17,"rows_kept":16,"cut":false,"hidden":false,"merged":[[0,0,0,3],[10,0,10,3]]}
["Klasyfikacja weteranów"]
["Nazwisko, Imię","kategoria","przeliczone punkty","%"]
["Chojnicki Janusz","HFT2",61,{"$f":"C3/$Q$12","v":0.91044776119402981}]
["Winiarek Mirosław","FT",67,{"$f":"C4/$Q$10","v":0.88157894736842102}]
["Białek Józef","HFT1",66,{"$f":"C5/$Q$11","v":0.8571428571428571}]
["Sadowski Eugeniusz","HFT1",64,{"$f":"C6/$Q$11","v":0.83116883116883122}]
["Floryn Marek","HFT2",55,{"$f":"C7/$Q$12","v":0.82089552238805974}]
["Domagała Leszek","FT",60,{"$f":"C8/$Q$10","v":0.78947368421052633}]
[]
[null,null,null,null,null,null,null,null,null,null,null,null,null,null,null,"FT max",76]
["Klasyfikacja kobiet",null,null,null,null,null,null,null,null,null,null,null,null,null,null,"HFT1 max",77]
["Nazwisko, Imię","kategoria","przeliczone punkty","%",null,null,null,null,null,null,null,null,null,null,null,"HFT2 max",67]
["Machowicz Anna","HFT1",62,{"$f":"C13/$Q$11","v":0.80519480519480524}]
["Frasińska Katarzyna","FT",61,{"$f":"C14/$Q$10","v":0.80263157894736847}]
["Czorny Magdalena","FT",59,{"$f":"C15/$Q$10","v":0.77631578947368418}]
["Dębecka Marta","HFT1",54,{"$f":"C16/$Q$11","v":0.70129870129870131}]

{"sheet":"DaneZawodnikow","index":9,"n_rows":84,"n_cols":16,"rows_kept":84,"cut":false,"hidden":false,"merged":[]}
["Imię","Nazwisko","Imię + Nazwisko","Nick","FT","HFT 1","HFT 2","JUNIOR","SP","SK","nHFT","W","K","katG","katDod","katW"]
["Krzysztof","Adamczak",{"$f":"B2&\" \"&A2","v":"Adamczak Krzysztof"},"krzysieka",{"$f":"IF($N2=\"FT\",1,\"\")","v":1},{"$f":"IF($N2=\"HFT 1\",1,\"\")","v":""},{"$f":"IF($N2=\"HFT 2\",1,\"\")","v":""},{"$f":"IF(ISNUMBER(SEARCH(\"Junior\",$P2)),1,\"\")","v":""},{"$f":"IF(ISNUMBER(SEARCH(\"Sylwetki pistolet\",$O2)),1,\"\")","v":""},{"$f":"IF(ISNUMBER(SEARCH(\"Sylwetki karabin\",$O2)),1,\"\")","v":""},{"$f":"IF(ISNUMBER(SEARCH(\"nHFT\",$O2)),1,\"\")","v":""},{"$f":"IF(ISNUMBER(SEARCH(\"Weteran\",$P2)),1,\"\")","v":""},{"$f":"IF(RIGHT(A2,1)=\"a\",1,\"\")","v":""},"FT",null,"Senior"]
["Piotr","Augustyniak","Augustyniak Piotr","Augustyn",1,"","","","","","","","","FT",null,"Senior"]
["Sławomir","Badziński","Badziński Sławomir","slawol75","","",1,"","","","","","","HFT 2",null,"Senior"]
["Józef","Białek","Białek Józef","Josef","",1,"","","","","",1,"","HFT 1",null,"Weteran (od 60 lat)"]
["Piotr","Brandys","Brandys Piotr","Brandon","",1,"","","","","","","","HFT 1",null,"Senior"]
["Artur","Budny","Budny Artur","Artur555","","",1,"","","","","","","HFT 2",null,"Senior"]
["Teresa","Chojnicka","Chojnicka Teresa","T-1000","","","","","","","","",1,"Piknikowiec",null,"Piknikowiec"]
["Janusz","Chojnicki","Chojnicki Janusz","Spinner","","",1,"","","","",1,"","HFT 2",null,"Weteran (od 60 lat)"]
["Tomasz","Cielepak","Cielepak Tomasz","MASZOT","",1,"","","",1,1,"","","HFT 1","Sylwetki karabin, nHFT","Senior"]
["Maciej","Dąbrowski","Dąbrowski Maciej","Maciej Alfa","",1,"","","","",1,"","","HFT 1","nHFT","Senior"]
["Michał","Dąbrowski","Dąbrowski Michał","Michał Alfa","",1,"",1,"","",1,"","","HFT 1","nHFT","Junior Open ( 9-16 lat)"]
["Marta","Dębecka","Dębecka Marta","Lennox","",1,"","","","","","",1,"HFT 1",null,"Senior"]
["Leszek","Domagała","Domagała Leszek","Willi",1,"","","","","","",1,"","FT",null,"Weteran (od 60 lat)"]
["Mateusz","Dominiak","Dominiak Mateusz","Domin","",1,"","","","","","","","HFT 1",null,"Senior"]
["Marcin","Drabik","Drabik Marcin","DrA",1,"","","","","","","","","FT",null,"Senior"]
["Andrzej","Dylewski","Dylewski Andrzej","Andrzej",1,"","","","","","","","","FT",null,"Senior"]
["Marek","Floryn","Floryn Marek","StgMechanik","","",1,"","","","",1,"","HFT 2",null,"Weteran (od 60 lat)"]
["Katarzyna","Frasińska","Frasińska Katarzyna","Kasia F",1,"","","","","","","",1,"FT",null,"Senior"]
["Julia","Gacek","Gacek Julia","Julcia","",1,"",1,"","","","",1,"HFT 1",null,"Junior Open ( 9-16 lat)"]
["Tomasz","Gacek","Gacek Tomasz","WuDe","",1,"","","",1,1,"","","HFT 1","Sylwetki karabin, nHFT","Senior"]
["Janusz","Gawęda","Gawęda Janusz","pitus5","","","","",1,1,"",1,"","Piknikowiec","Sylwetki karabin, Sylwetki pistolet","Weteran (od 60 lat)"]
["Mariusz","Kaczmarek","Kaczmarek Mariusz","Mario_64","",1,"","",1,1,"","","","HFT 1","Sylwetki karabin, Sylwetki pistolet","Senior"]
["Piotr","Kaczmarek","Kaczmarek Piotr","Silart","","",1,"","","","","","","HFT 2",null,"Senior"]
["Bartłomiej","Kaźmierczak","Kaźmierczak Bartłomiej","BARTEZZ","",1,"","","","",1,"","","HFT 1","nHFT","Senior"]
["Jakub","Kerber","Kerber Jakub","Lord Rzeźnik","",1,"","","","",1,"","","HFT 1","nHFT","Senior"]
["Antoni","Korczyński","Korczyński Antoni","Antek","",1,"",1,"","",1,"","","HFT 1","nHFT","Junior Open ( 9-16 lat)"]
["Dariusz","Korczyński","Korczyński Dariusz","-","","","","","","","","","","Piknikowiec",null,"Piknikowiec"]
["Artur","Korpalski","Korpalski Artur","Artkor","",1,"","","",1,"","","","HFT 1","Sylwetki karabin","Senior"]
["Artur","Korpalski","Korpalski Artur","Artkor","",1,"","",1,1,"","","","HFT 1","Sylwetki karabin, Sylwetki pistolet","Senior"]
["Jacek","Kostowski","Kostowski Jacek","pilot68","",1,"","","","","","","","HFT 1",null,"Senior"]
["Krzysztof","Kowalczyk","Kowalczyk Krzysztof","krzysztofk","",1,"","","","",1,"","","HFT 1","nHFT","Senior"]
["Marek","Krempczyński","Krempczyński Marek","Łysy","",1,"","",1,1,1,"","","HFT 1","Sylwetki karabin, Sylwetki pistolet, nHFT","Senior"]
["Andrzej","Król",{"$f":"B34&\" \"&A34","v":"Król Andrzej"},"kombatant",{"$f":"IF($N34=\"FT\",1,\"\")","v":""},{"$f":"IF($N34=\"HFT 1\",1,\"\")","v":""},{"$f":"IF($N34=\"HFT 2\",1,\"\")","v":""},{"$f":"IF(ISNUMBER(SEARCH(\"Junior\",$P34)),1,\"\")","v":""},{"$f":"IF(ISNUMBER(SEARCH(\"Sylwetki pistolet\",$O34)),1,\"\")","v":1},{"$f":"IF(ISNUMBER(SEARCH(\"Sylwetki karabin\",$O34)),1,\"\")","v":1},{"$f":"IF(ISNUMBER(SEARCH(\"nHFT\",$O34)),1,\"\")","v":""},{"$f":"IF(ISNUMBER(SEARCH(\"Weteran\",$P34)),1,\"\")","v":1},{"$f":"IF(RIGHT(A34,1)=\"a\",1,\"\")","v":""},"Piknikowiec","Sylwetki karabin, Sylwetki pistolet","Weteran (od 60 lat)"]
["Jacek","Krystek","Krystek Jacek","zantara","",1,"","","","","","","","HFT 1",null,"Senior"]
["Kostek","Lamcha","Lamcha Kostek","Kostek","","",1,1,"","","","","","HFT 2",null,"Junior Open ( 9-16 lat)"]
["Marcin","Lamcha","Lamcha Marcin","Lamus","","",1,"","","","","","","HFT 2",null,"Senior"]
["Grzegorz","Lisowski","Lisowski Grzegorz","Lisek","",1,"","",1,"",1,"","","HFT 1","Sylwetki pistolet, nHFT","Senior"]
["Anna","Machowicz","Machowicz Anna","Anna","",1,"","","","","","",1,"HFT 1",null,"Senior"]
["Krzysztof","Machowicz","Machowicz Krzysztof","yamrt","",1,"","","","","","","","HFT 1",null,"Senior"]
["Mirosław","Maciejewicz","Maciejewicz Mirosław","Krauser","",1,"","","","",1,"","","HFT 1","nHFT"]
["Marcin","Markisz","Markisz Marcin","MarcinMM",1,"","",1,"","","","","","FT",null,"Junior Open ( 9-16 lat)"]
["Karol","Mazurek","Mazurek Karol","lupus","",1,"","","","","","","","HFT 1",null,"Senior"]
["Tomasz","Merski","Merski Tomasz","Jester",1,"","","","","","","","","FT",null,"Senior"]
["Norbert","Nachman","Nachman Norbert","Groul","",1,"","","","","","","","HFT 1",null,"Senior"]
["Jarosław","Narbut","Narbut Jarosław","Jarn","",1,"","","","","","","","HFT 1",null,"Senior"]
["Sławomir","Opiela","Opiela Sławomir","AJU","","",1,"","","","","","","HFT 2",null,"Senior"]
["Rafał","Pachnik","Pachnik Rafał","ralph",1,"","","","","","","","","FT",null,"Senior"]
["Adam","Poliński","Poliński Adam","kadzislaw",1,"","","","","","","","","FT",null,"Senior"]
["Piotr","Remiszewski","Remiszewski Piotr","red5555","",1,"","",1,1,1,"","","HFT 1","Sylwetki karabin, Sylwetki pistolet, nHFT","Senior"]
["Piotr","Rose","Rose Piotr","box555","","","","",1,1,"","","","Piknikowiec","Sylwetki karabin, Sylwetki pistolet","Senior"]
["Radosław","Rozum","Rozum Radosław","Roar",1,"","","","","","","","","FT",null,"Senior"]
["Dariusz","Rup","Rup Dariusz","Zapp",1,"","","","","","","","","FT",null,"Senior"]
["Artur","Rybarczyk","Rybarczyk Artur","ArturR","","","","","",1,"","","","Piknikowiec","Sylwetki karabin","Senior"]
["Eugeniusz","Sadowski","Sadowski Eugeniusz","eugsad","",1,"","","",1,1,1,"","HFT 1","Sylwetki karabin, nHFT","Weteran (od 60 lat)"]
["Piotr","Słowik","Słowik Piotr","Włamywacz","","","","","",1,"","","","Piknikowiec","Sylwetki karabin","Senior"]
["Mikołaj","Soloch","Soloch Mikołaj","Mikuś","","","","","","","","","","Piknikowiec",null,"Senior"]
["Michał","Sroczyński","Sroczyński Michał","Michał","",1,"","","","",1,"","","HFT 1","nHFT","Senior"]
["Krzysztof","Szałkowski","Szałkowski Krzysztof","Kris","",1,"","","",1,1,"","","HFT 1","Sylwetki karabin, nHFT","Senior"]
["Krzysztof","Szeszuła","Szeszuła Krzysztof","Megabos","",1,"","","",1,1,"","","HFT 1","Sylwetki karabin, nHFT","Senior"]
["Maciej","Szłapka","Szłapka Maciej","MaciejSz","",1,"","","","",1,"","","HFT 1","nHFT","Senior"]
["Darek","Szymanowski","Szymanowski Darek","sindbad","",1,"","","","","","","","HFT 1",null,"Senior"]
["Łukasz","Śmigaj","Śmigaj Łukasz","Łukasz","","","","","",1,"","","","Piknikowiec","Sylwetki karabin","Senior"]
["Magdalena","Tałaj","Tałaj Magdalena","Maja","","","","","","","","",1,"Piknikowiec",null,"Piknikowiec"]
["Szymon","Tałaj","Tałaj Szymon","slowroots",1,"","","","",1,"","","","FT","Sylwetki karabin","Senior"]
["Aleksandra","Wieloszyńska",{"$f":"B66&\" \"&A66","v":"Wieloszyńska Aleksandra"},"`=Ola=",{"$f":"IF($N66=\"FT\",1,\"\")","v":""},{"$f":"IF($N66=\"HFT 1\",1,\"\")","v":""},{"$f":"IF($N66=\"HFT 2\",1,\"\")","v":""},{"$f":"IF(ISNUMBER(SEARCH(\"Junior\",$P66)),1,\"\")","v":""},{"$f":"IF(ISNUMBER(SEARCH(\"Sylwetki pistolet\",$O66)),1,\"\")","v":1},{"$f":"IF(ISNUMBER(SEARCH(\"Sylwetki karabin\",$O66)),1,\"\")","v":1},{"$f":"IF(ISNUMBER(SEARCH(\"nHFT\",$O66)),1,\"\")","v":""},{"$f":"IF(ISNUMBER(SEARCH(\"Weteran\",$P66)),1,\"\")","v":""},{"$f":"IF(RIGHT(A66,1)=\"a\",1,\"\")","v":1},"Piknikowiec","Sylwetki karabin, Sylwetki pistolet","Senior"]
["Krzysztof","Wietrzykowski","Wietrzykowski Krzysztof","Krzysztof W.","",1,"","","",1,"","","","HFT 1","Sylwetki karabin","Senior"]
["Paweł","Wietrzykowski","Wietrzykowski Paweł","PawełW","",1,"","","","","","","","HFT 1",null,"Senior"]
["Mirosław","Winiarek","Winiarek Mirosław","wirek",1,"","","","","","",1,"","FT",null,"Weteran (od 60 lat)"]
["Robert","Wolski","Wolski Robert","Wola","",1,"","","",1,1,"","","HFT 1","Sylwetki karabin, nHFT","Senior"]
["Robert","Wróbel","Wróbel Robert","Photomaker","","","","",1,1,"","","","Piknikowiec","Sylwetki karabin, Sylwetki pistolet","Senior"]
["Marek","Wziętek","Wziętek Marek","Maruch","",1,"","","","","","","","HFT 1",null,"Senior"]
["Arkadiusz","Zacharzewski","Zacharzewski Arkadiusz","Rek","",1,"","","","","","","","HFT 1",null,"Senior"]
["Jan","Zataj","Zataj Jan","JZ",1,"","",1,"","","","","","FT",null,"Junior Open ( 9-16 lat)"]
["Tomasz","Zataj","Zataj Tomasz","TZ",1,"","","","","","","","","FT",null,"Senior"]
["Marcin","Zgiernicki","Zgiernicki Marcin","Mazgier","","",1,"","","",1,"","","HFT 2","nHFT","Senior"]
["Rafał","Zych","Zych Rafał","Snajper","",1,"","","","","","","","HFT 1",null,"Senior"]
["Krzysztof","Wołowicz",{"$f":"B78&\" \"&A78","v":"Wołowicz Krzysztof"},"Piżol",{"$f":"IF($N78=\"FT\",1,\"\")","v":""},{"$f":"IF($N78=\"HFT 1\",1,\"\")","v":1},{"$f":"IF($N78=\"HFT 2\",1,\"\")","v":""},{"$f":"IF(ISNUMBER(SEARCH(\"Junior\",$P78)),1,\"\")","v":""},{"$f":"IF(ISNUMBER(SEARCH(\"Sylwetki pistolet\",$O78)),1,\"\")","v":""},{"$f":"IF(ISNUMBER(SEARCH(\"Sylwetki karabin\",$O78)),1,\"\")","v":""},{"$f":"IF(ISNUMBER(SEARCH(\"nHFT\",$O78)),1,\"\")","v":""},{"$f":"IF(ISNUMBER(SEARCH(\"Weteran\",$P78)),1,\"\")","v":""},{"$f":"IF(RIGHT(A78,1)=\"a\",1,\"\")","v":""},"HFT 1"]
["Leszek","Sawicki","Sawicki Leszek","PaPaj","",1,"","","","","","","","HFT 1"]
["Jarosław","Majda","Majda Jarosław","czaputek",1,"","","","","","","","","FT"]
["Magdalena","Czorny","Czorny Magdalena","Czorna",1,"","","","","","","",1,"FT"]
[null,null,{"$f":"B82&\" \"&A82","v":" "},null,{"$f":"IF($N82=\"FT\",1,\"\")","v":""},{"$f":"IF($N82=\"HFT 1\",1,\"\")","v":""},{"$f":"IF($N82=\"HFT 2\",1,\"\")","v":""},{"$f":"IF(ISNUMBER(SEARCH(\"Junior\",$P82)),1,\"\")","v":""},{"$f":"IF(ISNUMBER(SEARCH(\"Sylwetki pistolet\",$O82)),1,\"\")","v":""},{"$f":"IF(ISNUMBER(SEARCH(\"Sylwetki karabin\",$O82)),1,\"\")","v":""},{"$f":"IF(ISNUMBER(SEARCH(\"nHFT\",$O82)),1,\"\")","v":""},{"$f":"IF(ISNUMBER(SEARCH(\"Weteran\",$P82)),1,\"\")","v":""},{"$f":"IF(RIGHT(A82,1)=\"a\",1,\"\")","v":""}]
[null,null," ",null,"","","","","","","","",""]
[null,null," ",null,"","","","","","","","",""]