{"text_format":"1","workbook":"xlsx","n_sheets":10,"sheets":["FT","HFT1","HFT2","nHFT","JUNIOR","DRUŻYNY","Sylwetki Karabin","Sylwetki Pistolet","Weterani i Kobiety","DaneZawodnikow"],"not_rendered":{"charts":0,"images":0,"macros":1,"external_links":0,"defined_names":1,"comments":0,"pivot_tables":0},"unopened":[],"bounds":{"document_bytes":16777216,"sheet_cells":100000,"rows_first":2000,"rows_last":500,"rows_between":2000,"halvings":0,"cell_chars":16384,"cell_head_chars":4096},"cells_cut":0,"cells_raw":0,"read":"whole","date_system":"1900"}

{"sheet":"FT","index":0,"n_rows":24,"n_cols":47,"rows_kept":24,"cut":false,"hidden":false,"merged":[[5,2,5,4],[6,2,6,4],[5,0,5,1],[6,0,6,1],[3,0,3,1],[4,2,4,4],[4,0,4,1],[3,6,3,46],[1,0,1,1],[0,3,0,5],[1,3,1,5],[2,3,2,5],[3,2,3,4]]}
["Celów:",40]
[null,null,null,"% trafień",null,null,{"$f":"(COUNTIF(G9:G74,1)/COUNTA(G9:G74))*100","v":100},{"$f":"(COUNTIF(H9:H74,1)/COUNTA(H9:H74))*100","v":93.75},81.25,81.25,81.25,68.75,68.75,68.75,100,75,50,62.5,68.75,50,68.75,37.5,75,31.25,18.75,6.25,81.25,87.5,81.25,87.5,87.5,56.25,37.5,25,62.5,56.25,87.5,81.25,50,56.25,81.25,62.5,75,68.75,81.25,87.5]
[null,null,null,"% pudło",null,null,{"$f":"(COUNTIF(G9:G74,0)/COUNTA(G9:G74))*100","v":0},{"$f":"(COUNTIF(H9:H74,0)/COUNTA(H9:H74))*100","v":6.25},18.75,18.75,18.75,31.25,31.25,31.25,0,25,50,37.5,31.25,50,31.25,62.5,25,68.75,81.25,93.75,18.75,12.5,18.75,12.5,12.5,43.75,62.5,75,37.5,43.75,12.5,18.75,50,43.75,18.75,37.5,25,31.25,18.75,12.5]
[]
[null,null,null,null,null,"Cel nr",1,2,3,4,5,6,7,8,9,10,11,12,13,14,15,16,17,18,19,20,21,22,23,24,25,26,27,28,29,30,31,32,33,34,35,36,37,38,39,40,"D"]
["Data:",null,43611,null,null,"dystans [m]",23,20,37,44,30,39,42,49,9,32,46,42,38,50,24,30,42,50,31,38,19,21,25,39,40,33,30,40,22,37,33,40,41,50,34,22.5,19,27,31,16]
["Kategoria:",null,"FT",null,null,"KZ [mm]",15,20,25,40,25,40,35,40,20,30,40,40,35,40,35,40,35,40,35,40,15,20,20,40,40,25,40,40,15,30,30,40,35,40,25,15,15,20,35,35]
["Miejsce","Imię, nazwisko","Nick","Suma punktów","% do zwycięzcy","postawa/ uwagi",null,null,null,null,null,null,null,null,null,null,null,null,null,null,"kl","kl",null,null,"st","st",null,null,null,null,null,null,"st","st",null,null,null,null,null,null,"m",null,null,null,"kl","kl"]
{"$rows_left_out":17}
{"sheet":"HFT1","index":1,"n_rows":41,"n_cols":47,"rows_kept":41,"cut":false,"hidden":false,"merged":[[6,0,6,1],[6,2,6,4],[0,3,0,5],[1,0,1,1],[1,3,1,5],[2,3,2,5],[3,0,3,1],[3,2,3,4],[3,6,3,46],[4,0,4,1],[4,2,4,4],[5,0,5,1],[5,2,5,4]]}
["Celów:",40,null,"% trafień za 2 pkt",null,null,{"$f":"(COUNTIF(G9:G74,2)/COUNTA(G9:G74))*100","v":100},{"$f":"(COUNTIF(H9:H74,2)/COUNTA(H9:H74))*100","v":81.818181818181827},84.848484848484844,78.787878787878782,63.636363636363633,87.878787878787875,69.696969696969703,81.818181818181827,84.848484848484844,57.575757575757578,54.54545454545454,63.636363636363633,66.666666666666657,81.818181818181827,60.606060606060609,36.363636363636367,90.909090909090907,72.727272727272734,24.242424242424242,24.242424242424242,81.818181818181827,75.757575757575751,93.939393939393938,72.727272727272734,69.696969696969703,69.696969696969703,36.363636363636367,18.181818181818183,66.666666666666657,78.787878787878782,69.696969696969703,81.818181818181827,57.575757575757578,96.969696969696969,60.606060606060609,75.757575757575751,81.818181818181827,66.666666666666657,51.515151515151516,84.848484848484844]
[null,null,null,"% trafień za 1 pkt",null,null,{"$f":"(COUNTIF(G9:G74,1)/COUNTA(G9:G74))*100","v":0},{"$f":"(COUNTIF(H9:H74,1)/COUNTA(H9:H74))*100","v":18.181818181818183},15.151515151515152,21.212121212121211,36.363636363636367,12.121212121212121,30.303030303030305,18.181818181818183,15.151515151515152,42.424242424242422,42.424242424242422,27.27272727272727,30.303030303030305,18.181818181818183,39.393939393939391,63.636363636363633,9.0909090909090917,27.27272727272727,72.727272727272734,72.727272727272734,18.181818181818183,24.242424242424242,6.0606060606060606,27.27272727272727,30.303030303030305,30.303030303030305,51.515151515151516,69.696969696969703,33.333333333333329,21.212121212121211,27.27272727272727,18.181818181818183,39.393939393939391,3.0303030303030303,27.27272727272727,24.242424242424242,18.181818181818183,33.333333333333329,45.454545454545453,12.121212121212121]
[null,null,null,"% trafień za 0 pkt",null,null,{"$f":"(COUNTIF(G9:G74,0)/COUNTA(G9:G74))*100","v":0},{"$f":"(COUNTIF(H9:H74,0)/COUNTA(H9:H74))*100","v":0},0,0,0,0,0,0,0,0,3.0303030303030303,9.0909090909090917,3.0303030303030303,0,0,0,0,0,3.0303030303030303,3.0303030303030303,0,0,0,0,0,0,12.121212121212121,12.121212121212121,0,0,3.0303030303030303,0,3.0303030303030303,0,12.121212121212121,0,0,0,3.0303030303030303,3.0303030303030303]
[]
[null,null,null,null,null,"Cel nr",1,2,3,4,5,6,7,8,9,10,11,12,13,14,15,16,17,18,19,20,21,22,23,24,25,26,27,28,29,30,31,32,33,34,35,36,37,38,39,40,"D"]
["Data:",null,43611,null,null,"dystans [m]",23,20,22.5,37,18,30,42,38,9,32,37,42,38,32,24,30,33,42,31,30,19,21,25,21,40,33,30,32,22,37,33,24,41,19,34,22.5,19,27,31,16]
["Kategoria:",null,"HFT1",null,null,"KZ [mm]",15,20,20,25,15,25,35,40,20,30,25,40,35,30,35,40,25,35,35,40,15,20,20,15,40,25,40,35,15,30,30,20,35,15,25,15,15,20,35,35]
["Miejsce","Imię, nazwisko","Nick","Suma punktów","% do zwycięzcy","postawa/ uwagi",null,null,"L","L",null,null,null,null,null,null,null,null,null,null,"kl","kl",null,null,"st","st",null,null,"L","L",null,null,"st","st",null,null,null,null,null,null,"m",null,null,null,"kl","kl"]
{"$rows_left_out":34}
{"sheet":"HFT2","index":2,"n_rows":16,"n_cols":47,"rows_kept":16,"cut":false,"hidden":false,"merged":[[6,0,6,1],[6,2,6,4],[0,3,0,5],[1,0,1,1],[1,3,1,5],[2,3,2,5],[3,0,3,1],[3,2,3,4],[3,6,3,46],[4,0,4,1],[4,2,4,4],[5,0,5,1],[5,2,5,4]]}
["Celów:",40,null,"% trafień za 2 pkt",null,null,{"$f":"(COUNTIF(G9:G74,2)/COUNTA(G9:G74))*100","v":87.5},{"$f":"(COUNTIF(H9:H74,2)/COUNTA(H9:H74))*100","v":50},75,50,50,75,62.5,87.5,50,50,37.5,62.5,37.5,50,37.5,12.5,62.5,50,0,0,25,37.5,62.5,25,37.5,37.5,37.5,37.5,37.5,25,37.5,62.5,25,87.5,37.5,62.5,50,50,37.5,75]
[null,null,null,"% trafień za 1 pkt",null,null,{"$f":"(COUNTIF(G9:G74,1)/COUNTA(G9:G74))*100","v":0},{"$f":"(COUNTIF(H9:H74,1)/COUNTA(H9:H74))*100","v":50},25,37.5,50,25,25,12.5,50,50,62.5,25,50,50,62.5,87.5,37.5,37.5,100,87.5,75,62.5,37.5,75,37.5,50,37.5,50,62.5,62.5,62.5,37.5,62.5,12.5,37.5,37.5,50,50,62.5,25]
[null,null,null,"% trafień za 0 pkt",null,null,{"$f":"(COUNTIF(G9:G74,0)/COUNTA(G9:G74))*100","v":12.5},{"$f":"(COUNTIF(H9:H74,0)/COUNTA(H9:H74))*100","v":0},0,12.5,0,0,12.5,0,0,0,0,12.5,12.5,0,0,0,0,12.5,0,12.5,0,0,0,0,25,12.5,25,12.5,0,12.5,0,0,12.5,0,25,0,0,0,0,0]
[]
[null,null,null,null,null,"Cel nr",1,2,3,4,5,6,7,8,9,10,11,12,13,14,15,16,17,18,19,20,21,22,23,24,25,26,27,28,29,30,31,32,33,34,35,36,37,38,39,40,"D"]
["Data:",null,43611,null,null,"dystans [m]",23,20,22.5,37,18,30,42,38,9,32,37,42,38,32,24,30,33,42,31,30,19,21,25,21,40,33,30,32,22,37,33,24,41,19,34,22.5,19,27,31,16]
["Kategoria:",null,"HFT2",null,null,"KZ [mm]",15,20,20,25,15,25,35,40,20,30,25,40,35,30,35,40,25,35,35,40,15,20,20,15,40,25,40,35,15,30,30,20,35,15,25,15,15,20,35,35]
["Miejsce","Imię, nazwisko","Nick","Suma punktów","% do zwycięzcy","postawa/ uwagi",null,null,"L","L",null,null,null,null,null,null,null,null,null,null,"kl","kl",null,null,"st","st",null,null,"L","L",null,null,"st","st",null,null,null,null,null,null,"m",null,null,null,"kl","kl"]
{"$rows_left_out":9}
{"sheet":"nHFT","index":3,"n_rows":25,"n_cols":47,"rows_kept":25,"cut":false,"hidden":false,"merged":[[6,0,6,1],[6,2,6,4],[0,3,0,5],[1,0,1,1],[1,3,1,5],[2,3,2,5],[3,0,3,1],[3,2,3,4],[3,6,3,46],[4,0,4,1],[4,2,4,4],[5,0,5,1],[5,2,5,4]]}
["Celów:",20,null,"% trafień za 2 pkt",null,null,{"$f":"(COUNTIF(G9:G74,2)/COUNTA(G9:G74))*100","v":94.117647058823522},{"$f":"(COUNTIF(H9:H74,2)/COUNTA(H9:H74))*100","v":76.470588235294116},82.35294117647058,64.705882352941174,58.82352941176471,76.470588235294116,76.470588235294116,76.470588235294116,82.35294117647058,88.235294117647058,52.941176470588239,35.294117647058826,52.941176470588239,82.35294117647058,94.117647058823522,94.117647058823522,76.470588235294116,94.117647058823522,76.470588235294116,64.705882352941174,{"$error":"#DIV/0!"},{"$error":"#DIV/0!"},{"$error":"#DIV/0!"},{"$error":"#DIV/0!"},{"$error":"#DIV/0!"},{"$error":"#DIV/0!"},{"$error":"#DIV/0!"},{"$error":"#DIV/0!"},{"$error":"#DIV/0!"},{"$error":"#DIV/0!"},{"$error":"#DIV/0!"},{"$error":"#DIV/0!"},{"$error":"#DIV/0!"},{"$error":"#DIV/0!"},{"$error":"#DIV/0!"},{"$error":"#DIV/0!"},{"$error":"#DIV/0!"},{"$error":"#DIV/0!"},{"$error":"#DIV/0!"},{"$error":"#DIV/0!"}]
[null,null,null,"% trafień za 1 pkt",null,null,{"$f":"(COUNTIF(G9:G74,1)/COUNTA(G9:G74))*100","v":5.8823529411764701},{"$f":"(COUNTIF(H9:H74,1)/COUNTA(H9:H74))*100","v":23.52941176470588},17.647058823529413,35.294117647058826,41.17647058823529,23.52941176470588,23.52941176470588,23.52941176470588,17.647058823529413,11.76470588235294,47.058823529411761,47.058823529411761,41.17647058823529,17.647058823529413,5.8823529411764701,5.8823529411764701,23.52941176470588,5.8823529411764701,23.52941176470588,35.294117647058826,{"$error":"#DIV/0!"},{"$error":"#DIV/0!"},{"$error":"#DIV/0!"},{"$error":"#DIV/0!"},{"$error":"#DIV/0!"},{"$error":"#DIV/0!"},{"$error":"#DIV/0!"},{"$error":"#DIV/0!"},{"$error":"#DIV/0!"},{"$error":"#DIV/0!"},{"$error":"#DIV/0!"},{"$error":"#DIV/0!"},{"$error":"#DIV/0!"},{"$error":"#DIV/0!"},{"$error":"#DIV/0!"},{"$error":"#DIV/0!"},{"$error":"#DIV/0!"},{"$error":"#DIV/0!"},{"$error":"#DIV/0!"},{"$error":"#DIV/0!"}]
[null,null,null,"% trafień za 0 pkt",null,null,{"$f":"(COUNTIF(G9:G74,0)/COUNTA(G9:G74))*100","v":0},{"$f":"(COUNTIF(H9:H74,0)/COUNTA(H9:H74))*100","v":0},0,0,0,0,0,0,0,0,0,17.647058823529413,5.8823529411764701,0,0,0,0,0,0,0,{"$error":"#DIV/0!"},{"$error":"#DIV/0!"},{"$error":"#DIV/0!"},{"$error":"#DIV/0!"},{"$error":"#DIV/0!"},{"$error":"#DIV/0!"},{"$error":"#DIV/0!"},{"$error":"#DIV/0!"},{"$error":"#DIV/0!"},{"$error":"#DIV/0!"},{"$error":"#DIV/0!"},{"$error":"#DIV/0!"},{"$error":"#DIV/0!"},{"$error":"#DIV/0!"},{"$error":"#DIV/0!"},{"$error":"#DIV/0!"},{"$error":"#DIV/0!"},{"$error":"#DIV/0!"},{"$error":"#DIV/0!"},{"$error":"#DIV/0!"}]
[]
[null,null,null,null,null,"Cel nr",1,2,3,4,5,6,7,8,9,10,11,12,13,14,15,16,17,18,19,20,21,22,23,24,25,26,27,28,29,30,31,32,33,34,35,36,37,38,39,40,"D"]
["Data:",null,43610,null,null,"dystans [m]",18.5,20,17,34,18,30,34,38,21,32,37,42,41,32,22.5,33,19,27,31,21]
["Kategoria:",null,"nHFT",null,null,"KZ [mm]",15,20,20,25,15,25,35,40,20,30,25,40,35,30,25,35,15,20,25,20]
["Miejsce","Imię, nazwisko","Nick","Suma punktów","% do zwycięzcy","postawa/ uwagi"]
{"$rows_left_out":18}
{"sheet":"JUNIOR","index":4,"n_rows":10,"n_cols":47,"rows_kept":10,"cut":false,"hidden":false,"merged":[[6,0,6,1],[6,2,6,4],[0,3,0,5],[1,0,1,1],[1,3,1,5],[2,3,2,5],[3,0,3,1],[3,2,3,4],[3,6,3,46],[4,0,4,1],[4,2,4,4],[5,0,5,1],[5,2,5,4]]}
["Celów:",40,null,"% trafień za 2 pkt",null,null,{"$f":"(COUNTIF(G9:G74,2)/COUNTA(G9:G74))*100","v":100},{"$f":"(COUNTIF(H9:H74,2)/COUNTA(H9:H74))*100","v":50},50,0,50,0,50,0,0,0,0,0,0,0,0,0,50,50,0,0,50,50,50,50,0,0,0,0,50,0,50,50,50,50,50,100,50,50,0,0]
[null,null,null,"% trafień za 1 pkt",null,null,{"$f":"(COUNTIF(G9:G74,1)/COUNTA(G9:G74))*100","v":0},{"$f":"(COUNTIF(H9:H74,1)/COUNTA(H9:H74))*100","v":50},50,100,50,100,50,50,100,100,100,100,100,50,0,0,50,50,0,0,50,0,50,50,100,100,0,0,50,50,50,50,50,0,50,0,50,50,0,0]
[null,null,null,"% trafień za 0 pkt",null,null,{"$f":"(COUNTIF(G9:G74,0)/COUNTA(G9:G74))*100","v":0},{"$f":"(COUNTIF(H9:H74,0)/COUNTA(H9:H74))*100","v":0},0,0,0,0,0,50,0,0,0,0,0,50,0,0,0,0,0,0,0,50,0,0,0,0,0,0,0,50,0,0,0,50,0,0,0,0,0,0]
[]
[null,null,null,null,null,"Cel nr",1,2,3,4,5,6,7,8,9,10,11,12,13,14,15,16,17,18,19,20,21,22,23,24,25,26,27,28,29,30,31,32,33,34,35,36,37,38,39,40,"D"]
["Data:",null,43611,null,null,"dystans [m]",23,20,22.5,37,18,30,42,38,9,32,37,42,38,32,24,30,3,42,19,21,31,30,25,21,40,33,22,37,30,32,33,24,19,41,34,22.5,27,19,31,16]
["Kategoria:",null,"JUNIOR",null,null,"KZ [mm]",15,20,20,25,15,25,35,40,20,30,25,40,35,30,35,40,25,35,15,20,35,40,20,15,40,25,15,30,40,35,30,20,15,35,25,15,20,15,35,35]
["Miejsce","Imię, nazwisko","Nick","Suma punktów","% do zwycięzcy","postawa/ uwagi",null,null,"L","L",null,null,null,null,null,null,null,null,null,null,"kl","kl",null,null,"st","st",null,null,"L","L",null,null,"st","st",null,null,null,null,null,null,null,null,null,null,"kl","kl"]
{"$rows_left_out":3}
{"sheet":"DRUŻYNY","index":5,"n_rows":44,"n_cols":8,"rows_kept":44,"cut":false,"hidden":false,"merged":[]}
[]
["Drużyna","Nazwisko, Imię","Konkurencja","punkty (po przeliczeniu)","%"]
["WSST STRZELEC","Kostowski Jacek",{"$f":"IF(NOT(B3=\"\"),IF(VLOOKUP(B3,DaneZawodnikow!$C$2:$N$81,12,FALSE)<>0,VLOOKUP(B3,DaneZawodnikow!$C$2:$N$81,12,FALSE),\"\"),\"\")","v":"HFT 1"},{"$f":"IF(C3=\"HFT 1\",VLOOKUP(B3,'HFT1'!$B$9:$E$41,3,FALSE),IF(C3=\"HFT 2\",VLOOKUP(B3,'HFT2'!$B$9:$E$16,3,FALSE),IF(C3=\"FT\",VLOOKUP(B3,FT!$B$6:$E$21,3,FALSE),\"\")))","v":77},{"$f":"D3/$H$7","v":1}]
["WSST STRZELEC","Narbut Jarosław",{"$f":"IF(NOT(B4=\"\"),IF(VLOOKUP(B4,DaneZawodnikow!$C$2:$N$81,12,FALSE)<>0,VLOOKUP(B4,DaneZawodnikow!$C$2:$N$81,12,FALSE),\"\"),\"\")","v":"HFT 1"},{"$f":"IF(C4=\"HFT 1\",VLOOKUP(B4,'HFT1'!$B$9:$E$41,3,FALSE),IF(C4=\"HFT 2\",VLOOKUP(B4,'HFT2'!$B$9:$E$16,3,FALSE),IF(C4=\"FT\",VLOOKUP(B4,FT!$B$6:$E$21,3,FALSE),\"\")))","v":76},{"$f":"D4/$H$7","v":0.98701298701298701}]
["WSST STRZELEC","Szłapka Maciej",{"$f":"IF(NOT(B5=\"\"),IF(VLOOKUP(B5,DaneZawodnikow!$C$2:$N$81,12,FALSE)<>0,VLOOKUP(B5,DaneZawodnikow!$C$2:$N$81,12,FALSE),\"\"),\"\")","v":"HFT 1"},{"$f":"IF(C5=\"HFT 1\",VLOOKUP(B5,'HFT1'!$B$9:$E$41,3,FALSE),IF(C5=\"HFT 2\",VLOOKUP(B5,'HFT2'!$B$9:$E$16,3,FALSE),IF(C5=\"FT\",VLOOKUP(B5,FT!$B$6:$E$21,3,FALSE),\"\")))","v":71},0.92207792207792205,null,"przekalkulowane wyniki"]
["WSST STRZELEC","Krempczyński Marek",{"$f":"IF(NOT(B6=\"\"),IF(VLOOKUP(B6,DaneZawodnikow!$C$2:$N$81,12,FALSE)<>0,VLOOKUP(B6,DaneZawodnikow!$C$2:$N$81,12,FALSE),\"\"),\"\")","v":"HFT 1"},{"$f":"IF(C6=\"HFT 1\",VLOOKUP(B6,'HFT1'!$B$9:$E$41,3,FALSE),IF(C6=\"HFT 2\",VLOOKUP(B6,'HFT2'!$B$9:$E$16,3,FALSE),IF(C6=\"FT\",VLOOKUP(B6,FT!$B$6:$E$21,3,FALSE),\"\")))","v":68},0.88311688311688308,null,"FT max",76]
["WSST STRZELEC","Gacek Tomasz",{"$f":"IF(NOT(B7=\"\"),IF(VLOOKUP(B7,DaneZawodnikow!$C$2:$N$81,12,FALSE)<>0,VLOOKUP(B7,DaneZawodnikow!$C$2:$N$81,12,FALSE),\"\"),\"\")","v":"HFT 1"},{"$f":"IF(C7=\"HFT 1\",VLOOKUP(B7,'HFT1'!$B$9:$E$41,3,FALSE),IF(C7=\"HFT 2\",VLOOKUP(B7,'HFT2'!$B$9:$E$16,3,FALSE),IF(C7=\"FT\",VLOOKUP(B7,FT!$B$6:$E$21,3,FALSE),\"\")))","v":64},0.83116883116883122,null,"HFT1 max",77]
["WSST STRZELEC WYNIK",null,{"$f":"IF(NOT(B8=\"\"),IF(VLOOKUP(B8,DaneZawodnikow!$C$2:$N$81,12,FALSE)<>0,VLOOKUP(B8,DaneZawodnikow!$C$2:$N$81,12,FALSE),\"\"),\"\")","v":""},null,{"$f":"SUM(LARGE(E3:E7,{1;2;3}))","v":2.9090909090909092},null,"HFT2 max",67]
{"$rows_left_out":37}
{"sheet":"Sylwetki Karabin","index":6,"n_rows":28,"n_cols":47,"rows_kept":28,"cut":false,"hidden":false,"merged":[[3,6,3,25],[3,26,3,45],[0,3,0,5],[1,0,1,1],[1,3,1,5],[2,3,2,5],[3,0,3,1],[3,2,3,4],[4,0,4,1],[4,2,4,4],[5,0,5,1],[5,2,5,4],[6,0,6,1],[6,2,6,4],[5,26,6,30],[5,31,6,35],[5,36,6,40],[5,41,6,45],[5,5,6,5],[5,6,6,10],[5,11,6,15],[5,16,6,20],[5,21,6,25]]}
["Celów:",40]
[null,null,null,"% trafień",null,null,{"$f":"(COUNTIF(G9:G74,1)/COUNTA(G9:G74))*100","v":45},{"$f":"(COUNTIF(H9:H74,1)/COUNTA(H9:H74))*100","v":40},45,40,55.000000000000007,35,60,50,60,45,25,30,40,55.000000000000007,40,30,45,45,55.000000000000007,50,55.000000000000007,50,60,50,65,80,50,40,75,65,35,35,20,40,40,50,50,45,50,60]
[null,null,null,"% pudło",null,null,{"$f":"(COUNTIF(G9:G74,0)/COUNTA(G9:G74))*100","v":55.000000000000007},{"$f":"(COUNTIF(H9:H74,0)/COUNTA(H9:H74))*100","v":60},55.000000000000007,60,45,65,40,50,40,55.000000000000007,75,70,60,45,60,70,55.000000000000007,55.000000000000007,45,50,45,50,40,50,35,20,50,60,25,35,65,65,80,60,60,50,50,55.000000000000007,50,40]
[null,null,null,null,null,null,"Przejście pierwsze",null,null,null,null,null,null,null,null,null,null,null,null,null,null,null,null,null,null,null,"Przejście drugie"]
[null,null,null,null,null,"nr",1,2,3,4,5,6,7,8,9,10,11,12,13,14,15,16,17,18,19,20,1,2,3,4,5,6,7,8,9,10,11,12,13,14,15,16,17,18,19,20,"D"]
["Data:",null,43611,null,null,"sylwetka","kurczak",null,null,null,null,"dzik",null,null,null,null,"indyk",null,null,null,null,"muflon",null,null,null,null,"kurczak",null,null,null,null,"dzik",null,null,null,null,"indyk",null,null,null,null,"muflon"]
["Kategoria:",null,"Sylwetki Karabin"]
["Miejsce","Imię, nazwisko","Nick","Suma punktów","% do zwycięzcy","postawa/ uwagi"]
{"$rows_left_out":21}
{"sheet":"Sylwetki Pistolet","index":7,"n_rows":19,"n_cols":47,"rows_kept":19,"cut":false,"hidden":false,"merged":[[0,3,0,5],[1,0,1,1],[1,3,1,5],[2,3,2,5],[3,0,3,1],[3,2,3,4],[6,0,6,1],[6,2,6,4],[3,6,3,25],[3,26,3,45],[4,0,4,1],[4,2,4,4],[5,0,5,1],[5,2,5,4],[5,5,6,5],[5,6,6,10],[5,11,6,15],[5,16,6,20],[5,21,6,25],[5,26,6,30],[5,31,6,35],[5,36,6,40],[5,41,6,45]]}
["Celów:",40]
[null,null,null,"% trafień",null,null,{"$f":"(COUNTIF(G9:G74,1)/COUNTA(G9:G74))*100","v":45.454545454545453},{"$f":"(COUNTIF(H9:H74,1)/COUNTA(H9:H74))*100","v":54.54545454545454},45.454545454545453,54.54545454545454,36.363636363636367,63.636363636363633,45.454545454545453,63.636363636363633,36.363636363636367,36.363636363636367,63.636363636363633,36.363636363636367,18.181818181818183,36.363636363636367,27.27272727272727,27.27272727272727,45.454545454545453,63.636363636363633,63.636363636363633,36.363636363636367,63.636363636363633,63.636363636363633,54.54545454545454,72.727272727272734,45.454545454545453,45.454545454545453,36.363636363636367,45.454545454545453,63.636363636363633,72.727272727272734,27.27272727272727,54.54545454545454,36.363636363636367,63.636363636363633,27.27272727272727,54.54545454545454,36.363636363636367,45.454545454545453,54.54545454545454,45.454545454545453]
[null,null,null,"% pudło",null,null,{"$f":"(COUNTIF(G9:G74,0)/COUNTA(G9:G74))*100","v":54.54545454545454},{"$f":"(COUNTIF(H9:H74,0)/COUNTA(H9:H74))*100","v":45.454545454545453},54.54545454545454,45.454545454545453,63.636363636363633,36.363636363636367,54.54545454545454,36.363636363636367,63.636363636363633,63.636363636363633,36.363636363636367,63.636363636363633,81.818181818181827,63.636363636363633,72.727272727272734,72.727272727272734,54.54545454545454,36.363636363636367,36.363636363636367,63.636363636363633,36.363636363636367,36.363636363636367,45.454545454545453,27.27272727272727,54.54545454545454,54.54545454545454,63.636363636363633,54.54545454545454,36.363636363636367,27.27272727272727,72.727272727272734,45.454545454545453,63.636363636363633,36.363636363636367,72.727272727272734,45.454545454545453,63.636363636363633,54.54545454545454,45.454545454545453,54.54545454545454]
[null,null,null,null,null,null,"Przejście pierwsze",null,null,null,null,null,null,null,null,null,null,null,null,null,null,null,null,null,null,null,"Przejście drugie"]
[null,null,null,null,null,"nr",1,2,3,4,5,6,7,8,9,10,11,12,13,14,15,16,17,18,19,20,1,2,3,4,5,6,7,8,9,10,11,12,13,14,15,16,17,18,19,20,"D"]
["Data:",null,43611,null,null,"sylwetka","kurczak",null,null,null,null,"dzik",null,null,null,null,"indyk",null,null,null,null,"muflon",null,null,null,null,"kurczak",null,null,null,null,"dzik",null,null,null,null,"indyk",null,null,null,null,"muflon"]
["Kategoria:",null,"Sylwetki Pistolet"]
["Miejsce","Imię, nazwisko","Nick","Suma punktów","% do zwycięzcy","postawa/ uwagi"]
{"$rows_left_out":12}
{"sheet":"Weterani i Kobiety","index":8,"n_rows":16,"n_cols":17,"rows_kept":16,"cut":false,"hidden":false,"merged":[[0,0,0,3],[10,0,10,3]]}
["Klasyfikacja weteranów"]
["Nazwisko, Imię","kategoria","przeliczone punkty","%"]
["Chojnicki Janusz","HFT2",61,{"$f":"C3/$Q$12","v":0.91044776119402981}]
["Winiarek Mirosław","FT",67,{"$f":"C4/$Q$10","v":0.88157894736842102}]
["Białek Józef","HFT1",66,{"$f":"C5/$Q$11","v":0.8571428571428571}]
["Sadowski Eugeniusz","HFT1",64,{"$f":"C6/$Q$11","v":0.83116883116883122}]
["Floryn Marek","HFT2",55,{"$f":"C7/$Q$12","v":0.82089552238805974}]
["Domagała Leszek","FT",60,{"$f":"C8/$Q$10","v":0.78947368421052633}]
{"$rows_left_out":9}
{"sheet":"DaneZawodnikow","index":9,"n_rows":84,"n_cols":16,"rows_kept":84,"cut":false,"hidden":false,"merged":[]}
["Imię","Nazwisko","Imię + Nazwisko","Nick","FT","HFT 1","HFT 2","JUNIOR","SP","SK","nHFT","W","K","katG","katDod","katW"]
["Krzysztof","Adamczak",{"$f":"B2&\" \"&A2","v":"Adamczak Krzysztof"},"krzysieka",{"$f":"IF($N2=\"FT\",1,\"\")","v":1},{"$f":"IF($N2=\"HFT 1\",1,\"\")","v":""},{"$f":"IF($N2=\"HFT 2\",1,\"\")","v":""},{"$f":"IF(ISNUMBER(SEARCH(\"Junior\",$P2)),1,\"\")","v":""},{"$f":"IF(ISNUMBER(SEARCH(\"Sylwetki pistolet\",$O2)),1,\"\")","v":""},{"$f":"IF(ISNUMBER(SEARCH(\"Sylwetki karabin\",$O2)),1,\"\")","v":""},{"$f":"IF(ISNUMBER(SEARCH(\"nHFT\",$O2)),1,\"\")","v":""},{"$f":"IF(ISNUMBER(SEARCH(\"Weteran\",$P2)),1,\"\")","v":""},{"$f":"IF(RIGHT(A2,1)=\"a\",1,\"\")","v":""},"FT",null,"Senior"]
["Piotr","Augustyniak","Augustyniak Piotr","Augustyn",1,"","","","","","","","","FT",null,"Senior"]
["Sławomir","Badziński","Badziński Sławomir","slawol75","","",1,"","","","","","","HFT 2",null,"Senior"]
["Józef","Białek","Białek Józef","Josef","",1,"","","","","",1,"","HFT 1",null,"Weteran (od 60 lat)"]
["Piotr","Brandys","Brandys Piotr","Brandon","",1,"","","","","","","","HFT 1",null,"Senior"]
["Artur","Budny","Budny Artur","Artur555","","",1,"","","","","","","HFT 2",null,"Senior"]
["Teresa","Chojnicka","Chojnicka Teresa","T-1000","","","","","","","","",1,"Piknikowiec",null,"Piknikowiec"]
{"$rows_left_out":76}